{"text_format":"3","workbook":"xlsx","n_sheets":25,"sheets":["Willkommen","Cockpit","Einstellungen","Anlageziele","Daten Einstellg_Ziele","Daten Cockpit ","Vermentw.","Daten Vermögen","Vermerh.","Daten VE","Einn._Ausg.","Annahmen","Daten Projektion","Umschichtung","Umschichtungsbeschluss","Zahlen Basis","Zahlen Worst Case","Daten Umschichtung","Zahlen Umschichtung","Glossar","Eingabe Szenario","Analyse Szenario","Verwaltungskosten","Druck","Entwickler"],"not_rendered":{"charts":35,"images":18,"macros":1,"defined_names":29,"comments":7},"read":"whole","date_system":"1900"}

{"sheet":"Willkommen","index":0,"n_rows":60,"n_cols":5,"rows_kept":60}
{"$rows_empty":59}
[{"$nulls":3},"Version:",{"$f":"'Daten Einstellg_Ziele'!C5","v":"1.53b"}]

{"sheet":"Cockpit","index":1,"n_rows":120,"n_cols":16,"rows_kept":120}
[]
[]
[]
[]
[]
[{"$nulls":3},"Zielabweichung Status Quo/Projektion"]
{"$rows_empty":7}
[{"$nulls":12}," "]
{"$rows_empty":7}
[null,"Projektion Basisszenario"]
{"$rows_empty":13}
[null,"Erhaltungskonzept:",{"$f":"Anlageziele!E5","v":"Real"},{"$nulls":7},"Ertragskonzept:",{"$f":"Anlageziele!M5","v":"Zielausschüttung als Betrag"}]
[null,"Investitionsgrad:",{"$nulls":4},{"$f":"'Daten Cockpit '!D24","v":{"v":86.8421052631579,"d":"86.8"}},"%",null,null,"Verwaltungskostenquoten 1/2 in:",null,{"$f":"'Zahlen Basis'!F53*100","v":{"v":61.76377952755906,"d":"61.8"}},"%",{"$f":"'Zahlen Basis'!F54*100","v":{"v":53.55776587605203,"d":"53.6"}},"%"]
[null,"Zielzuwachs im Jahr","Ziel EUR",null,"Proj. EUR",null,"Abweichung",{"$nulls":3},"Ertragsziel im Jahr","Ziel EUR","Proj. EUR",null,"Abweichung"]
[null,{"$f":"'Zahlen Basis'!F4","v":2019},{"$f":"'Daten Cockpit '!C17","v":{"v":151518.56838255748,"d":"151,519"}},null,{"$f":"'Daten Cockpit '!C18","v":{"v":51750,"d":"51,750"}},null,{"$f":"'Daten Cockpit '!C20","v":{"v":-65.84577022313171,"d":"-65.8 "}},"%",null,null,{"$f":"B39","v":2019},{"$f":"'Daten Cockpit '!C30","v":{"v":64822.4,"d":"64,822"}},{"$f":"'Daten Cockpit '!C31","v":{"v":58500,"d":"58,500"}},null,{"$f":"'Daten Cockpit '!C33","v":{"v":-9.75341857135805,"d":"-9.8 "}},"%"]
[null,{"$f":"'Zahlen Basis'!J4","v":2023},{"$f":"'Daten Cockpit '!D17","v":{"v":164008.57125443965,"d":"164,009"}},null,{"$f":"'Daten Cockpit '!D18","v":{"v":54949.54298703279,"d":"54,950"}},null,{"$f":"'Daten Cockpit '!D20","v":{"v":-66.49593215357925,"d":"-66.5 "}},"%",null,null,{"$f":"B40","v":2023},{"$f":"'Daten Cockpit '!D30","v":{"v":67148.01368911056,"d":"67,148"}},{"$f":"'Daten Cockpit '!D31","v":{"v":61595.41190765626,"d":"61,595"}},null,{"$f":"'Daten Cockpit '!D33","v":{"v":-8.269197369206436,"d":"-8.3 "}},"%"]
[]
[{"$nulls":6}," "]
{"$rows_empty":11}
[null,"Risikoziele im Jahr 2018","Ziel EUR",null,"Proj. EUR",null,"Abweichung",{"$nulls":3},"Nachhaltigkeitsziel in","Ziel EUR","Proj. EUR",null,"Abweichung"]
[null,"Max. Verlust Investitionsverm.",{"$f":"'Daten Cockpit '!C39","v":{"v":-380000,"d":"-380,000 "}},null,{"$f":"'Daten Cockpit '!C40","v":{"v":-723450,"d":"-723,450 "}},null,{"$f":"'Daten Cockpit '!C42","v":{"v":-90.38157894736842,"d":"-90.4 "}},"%",null,null,"Nachhaltigkeit allg.",{"$f":"'Daten Cockpit '!$C$48","v":{"v":5818186.8609375,"d":"5,818,187"}},{"$f":"'Daten Cockpit '!C49","v":{"v":6757582.48125,"d":"6,757,582"}},null,{"$f":"'Daten Cockpit '!$C$51","v":{"v":16.145848230132856,"d":"16.1"}},"%"]
[null,"Max. Verlust Grundstock",{"$f":"'Daten Cockpit '!D39","v":0},null,{"$f":"'Daten Cockpit '!D40","v":0},null,{"$f":"'Daten Cockpit '!D42","v":{"v":0,"d":"0.0"}},"%",null,null,{"$f":"Anlageziele!L22","v":"Best in Class"},{"$f":"'Daten Cockpit '!$E$48","v":{"v":775758.248125,"d":"775,758"}},{"$f":"'Daten Cockpit '!E49","v":{"v":5278390.65,"d":"5,278,391"}},null,{"$f":"'Daten Cockpit '!$E$51","v":{"v":580.4169549931075,"d":"580.4"}},"%"]
[{"$nulls":10},"Impact Investing",{"$f":"'Daten Cockpit '!$D$48","v":{"v":775758.248125,"d":"775,758"}},{"$f":"'Daten Cockpit '!D49","v":0},null,{"$f":"'Daten Cockpit '!$D$51","v":{"v":-100,"d":"-100.0 "}},"%"]
[]
[]
[null,"Analyse Status Quo Vermögenserhaltung"]
[]
[{"$nulls":10},"Analyse:","Grundstock","Investitionsvermögen"]
[{"$nulls":11},"(SOLL)","(IST)"]
[{"$nulls":10},"Grundstock nominal",{"$f":"'Daten VE'!D51","v":{"v":6000000,"d":"6,000,000"}},null,"EUR"]
[{"$nulls":10},"Inflationsausgleich",{"$f":"'Daten VE'!D52","v":{"v":1575928.4191278955,"d":"1,575,928"}},null,"EUR"]
[{"$nulls":10},"Gesamt",{"$f":"L64+L65","v":{"v":7575928.4191278955,"d":"7,575,928"}},{"$f":"'Daten VE'!E53","v":{"v":7600000,"d":"7,600,000"}},"EUR"]
[{"$nulls":10},"Zielerreichung:",{"v":1,"d":"100%"},{"$f":"M66/L66","v":{"v":1.0031773770210564,"d":"100.32%"}}]
{"$rows_empty":12}
[null,"Basisszenario - Vermögensentwicklung nach Anlageklassen"]
{"$rows_empty":19}
[null,"Worst Case Szenario"]
{"$rows_empty":19}
[null,"Szenario Umschichtung"]

{"sheet":"Einstellungen","index":2,"n_rows":37,"n_cols":18,"rows_kept":37}
[]
[]
[]
[]
[null,null,"Name der Stiftung:","Paradigma-Stiftung",{"$nulls":6},"Anrede","Vorname Nachname bzw. Bezeichnung",{"$nulls":3},2]
[null,null,"Gründungsjahr (JJJJ)",2001,{"$nulls":5},"Ersteller/in:","Bitte auswählen",{"$nulls":4},2]
[null,null,"Planungsbeginn (JJJJ)",2019,{"$nulls":5},"Verantwortliches Gremienmitglied:","Bitte auswählen",{"$nulls":4},2]
[{"$nulls":9},"Berater/in","Bitte auswählen",{"$nulls":6},1]
[null,null,"Darstellung Vermögen (EUR/TEUR)","EUR ","EUR",{"$nulls":4},"Geschäftsführungsorgan","Vorstand",{"$nulls":4},1]
[null,null,"Projektion Jahre",5,"TEUR"]
[null,null,"Zielkorridor ",{"v":2,"d":"2.0"},"%",{"$nulls":4},"Mitglieder des Geschäftsführungsorgans"]
[{"$nulls":9},"Funktion; Vorname Nachname","Vorsitzende/r","Alfred Abel"]
[{"$nulls":9},"Funktion; Vorname Nachname","Finanzen","Bertram Bauer"]
[{"$nulls":9},"Funktion; Vorname Nachname","Mitglied","Charlotte Cäsar"]
[null,null,"Anlagerichtlinie vorhanden?","Nein",{"$nulls":5},"Funktion; Vorname Nachname","Mitglied","Dieter Döring"]
[{"$nulls":9},"Funktion; Vorname Nachname","Bitte auswählen"]
[null,null,"Restriktionen",{"$nulls":12},1,null,1]
[{"$nulls":9},"Aufsichtsorgan","Keines",{"$nulls":6},1]
[null,null,"Maximalquote Aktien",null,"auf","Bitte ausw.",{"$nulls":3},"Mitwirkung Aufsichtsorgan","Bitte auswählen",{"$nulls":6},1]
[null,null,"Maximalquote Renten",null,"auf","Bitte ausw."]
[null,null,"Maximalquote Immobilien"]
[null,null,"Mindestbonität Renten",{"$nulls":6},"Annahmen Inflation (Veränderung p.a. in %):",{"$nulls":5},1]
[null,null,"Maximalquote pro Einzelwert (Aktien/Renten)"]
[null,null,"Maximalquote pro Institut (Guthaben)",{"$nulls":6},{"$f":"D7","v":2019},{"v":0.02,"d":"2.0%"}]
[{"$nulls":9},{"$f":"J24+1","v":2020},{"v":0.02,"d":"2.0%"}]
[null,null,"Rücklagen",{"$nulls":6},{"$f":"J25+1","v":2021},{"v":0.02,"d":"2.0%"}]
[{"$nulls":9},2022,{"v":0.02,"d":"2.0%"}]
[null,null,"Bestand Kapitalrücklage",{"v":20000,"d":"20,000"},"EUR",{"$nulls":4},2023,{"v":0.02,"d":"2.0%"}]
[null,null,"Bestand Freie Rücklage",{"v":10000,"d":"10,000"},"EUR"]
[null,null,"Bildung der freien Rücklage aus Erträgen",{"v":33,"d":"33.0"},"% p.a.",{"$nulls":4},"Verwaltungkosten"]
[{"$nulls":15},1]
[{"$nulls":9},"Verwaltungskosten inflationieren?","Ja"]
[{"$nulls":9},"Begrenzung:"]
[{"$nulls":9},"Aufgriffsgrenze 1 (Stiftungsaufsicht):",{"v":33,"d":"33.0"},"%"]
[{"$nulls":9},"Aufgriffsgrenze 2 (Finanzamt):",{"v":25,"d":"25.0"},"%"]
[]
[null,"--- Ende der Eingaben ---"]

{"sheet":"Anlageziele","index":3,"n_rows":26,"n_cols":21,"rows_kept":26}
[]
[]
[]
[]
[null,null,"Vermögenserhaltungskonzept:",null,"Real",{"$nulls":4},"Ausschüttungspolitik",null,null,"Zielausschüttung als Betrag",{"$nulls":4},"Real",1,null,1]
[{"$nulls":17},"Nominal",null,null,1]
[{"$nulls":3},"Bei realer Vermögenserhaltung:",{"$nulls":6},{"$f":"IF(M5=\"Zielausschüttung als Betrag\",\"Betrag für Zweckverwirklichung:\",IF(M5='Daten Einstellg_Ziele'!D22,\"Prozent bezogen auf Grundstock\",\"Nur relevant bei Zielausschüttung\"))","v":"Betrag für Zweckverwirklichung:"},null,{"v":10000,"d":"10,000.00"},{"$f":"IF($M$5=\"Überschuss\",\"\",IF($M$5='Daten Einstellg_Ziele'!$D$22,\"%\",\"EUR\"))","v":"EUR"}]
[{"$nulls":3},"Maß für die Geldentwerung:","Verbraucherpreise (VPI)",{"$nulls":5},{"$f":"IF(M5=\"Überschuss\",\"\",\"entspricht (gerundet):\")","v":"entspricht (gerundet):"},null,{"$f":"IF(M5='Daten Einstellg_Ziele'!D22,'Daten VE'!D51*Anlageziele!M7%,IF(Anlageziele!M5='Daten Einstellg_Ziele'!D21,Anlageziele!M7/'Daten VE'!D51%,\"\"))","v":{"v":0.16666666666666666,"d":"0.17"}},{"$f":"IF($M$5=\"Überschuss\",\"\",IF($M$5='Daten Einstellg_Ziele'!$D$22,\"EUR\",\"%\"))","v":"%"}]
[{"$nulls":3},"Zeitraum der Erfolgsmessung:",1,"Jahr/e"]
[]
[{"$nulls":3},"Bei Verbrauchsstiftung:"]
[{"$nulls":3},"Verbrauchskonzept","Stiftung  auf  Zeit",{"$nulls":12},"Substanz",null,null,1]
[{"$nulls":3},{"$f":"IF(E12=\"Kapitaleinsatz p.a.\",\"Kapitaleinsatz p.a.\",\"Bestandsdauer ab Gründung\")","v":"Bestandsdauer ab Gründung"},20,{"$f":"IF(E12=\"Kapitaleinsatz p.a.\",\"EUR\",\"Jahre\")","v":"Jahre"},{"$nulls":11},"Verbrauch"]
[null,null," "]
[{"$nulls":17},"Verbraucherpreise (VPI)",1]
[]
[]
[]
[null,null,"Maximalverlust Grundstock:",null,{"v":0,"d":"0.0%"},{"$nulls":5},"Zieljahr",2021,{"$nulls":5},true]
[{"$nulls":4},{"$f":"IF(Vermerh.!B6<>0,Vermerh.!B6*Anlageziele!E19*-1,\"\")","v":{"v":0,"d":"0 €"}},{"$nulls":5},"Zielquote Nachhaltigkeit allgemein",null,{"v":0.75,"d":"75.0%"},{"$nulls":4},true]
[null,null,"Maximalverlust Investmentvermögen:",null,{"v":0.05,"d":"5.0%"},{"$nulls":5},"   Davon Zielquote Impact Investing",null,{"v":0.1,"d":"10.0%"},{"$nulls":4},true]
[{"$nulls":4},{"$f":"IF(Vermentw.!K14<>0,Vermentw.!K14*Anlageziele!E21*-1,\"\")","v":{"v":-380000,"d":"-380,000 €"}},{"$nulls":5},"   Davon Zielquote","Best in Class",{"v":0.1,"d":"10.0%"}]
[]
[]
[]
[null,"--- Ende der Eingaben ---"]

{"sheet":"Daten Einstellg_Ziele","index":4,"n_rows":28,"n_cols":8,"rows_kept":28,"hidden":true}
["Datenblatt Stammdaten/Anlageziele"]
[]
[null,"STAMMDATEN"]
[]
[null,"Version:","1.53b"]
[]
[null,"EUR_TEUR","Anrede","Geschäftsführungsorgan","Aufsichtsorgan","Mitwirkung Aufsicht","Gremienfunktion"]
[null,"EUR ","Bitte auswählen","Bitte auswählen","Keines","Bitte auswählen","Bitte auswählen"]
[null,"TEUR","Herr","Vorstand","Stiftungsrat","Einverständnis (vorher)","Vorsitzende/r"]
[null,null,"Frau ","Geschäftsführung","Aufsichtsrat","Genehmigung (nachher)","Finanzen"]
[{"$nulls":3},"Generalsekretär/in","Kuratorium","Information","Protokoll/Schriftf."]
[{"$nulls":3},"Kuratorium","Beirat","Anordnung","Mitglied"]
[{"$nulls":3},"Stiftungsrat","Sonstiges:"]
[{"$nulls":3},"Beirat"]
[{"$nulls":3},"Sonstiges:"]
[null,"ANLAGEZIELE"]
[]
[null,"Vermögenserhaltungskonzept","Verbrauchskonzept","Ausgaben_Stiftungszweck","Ja_Nein","Ausschüttungspolitik","Zielausschüttung","Projektionszeitraum"]
[null,"Bitte auswählen","Kapitaleinsatz p.a.","Bitte auswählen","Bitte ausw.","Bitte auswählen","Bitte ausw.","Bitte ausw."]
[null,"Real","Stiftung  auf  Zeit","Überschuss","Ja","Überschuss","quotenmäßig",{"$f":"Einstellungen!D7","v":2019}]
[null,"Nominal",null,"Zielausschüttung als Betrag","Nein","Zielausschüttung","summenmäßig",{"$f":"H20+1","v":2020}]
[null,"Substanz",null,"Zielausschüttung als Quote",{"$nulls":3},{"$f":"H21+1","v":2021}]
[null,"Verbrauch",{"$nulls":5},2022]
[{"$nulls":7},2023]
[null,"Maß_Geldentwertung","Bezugsvermögen"]
[null,"Verbraucherpreise (VPI)","Bitte ausw."]
[null,"Sonstiges","Gesamtvermögen"]
[null,null,"Wertpapiervermögen"]

{"sheet":"Daten Cockpit ","index":5,"n_rows":62,"n_cols":17,"rows_kept":62,"hidden":true}
["Daten Cockpit"]
[]
[null,"Projektion"]
[]
[null,"Basis",{"$f":"'Zahlen Basis'!J27+100%","v":{"v":0.936722178728491,"d":"93.67%"}}]
[null,"Worst Case",{"$f":"'Zahlen Worst Case'!J27+100%","v":{"v":0.815529215350545,"d":"81.55%"}}]
[]
[null,"Nachhaltigkeitsziel"]
[null,"Bitte auswählen"]
[null,"Ausschluss"]
[null,"Best in Class"]
[null,"Engagement"]
[]
[null,"Vermögenserhaltung",{"$f":"Anlageziele!E5","v":"Real"},null,null,"Tacho Vermögenserhaltung"]
[null,null,{"$f":"'Zahlen Basis'!F4","v":2019},{"$f":"'Zahlen Basis'!J4","v":2023},null,"Ausgangswert",{"$f":"'Daten VE'!H47","v":{"v":3.1773770210563193E-3,"d":"0.3%"}},{"$f":"D20/100","v":{"v":-0.6649593215357925,"d":"-66.5%"}},{"$nulls":3},"Wert","Ausschlag","Zoomfaktor"]
[null,"Zielwert:",{"$f":"'Daten VE'!I45","v":{"v":7727446.987510453,"d":"7,727,447"}},{"$f":"'Daten VE'!M45","v":{"v":8364437.133976433,"d":"8,364,437"}},{"$nulls":5},"Segmente",null,{"v":0,"d":"0%"},{"v":0.5,"d":"50%"},1.5]
[null,"Zielzuwachs zu Vorj.:",{"$f":"IF(C16-'Daten VE'!H45>0,C16-'Daten VE'!H45,1)","v":{"v":151518.56838255748,"d":"151,519"}},{"$f":"IF(D16-'Daten VE'!L45>0,D16-'Daten VE'!L45,1)","v":{"v":164008.57125443965,"d":"164,009"}},null,"Anzeige","Zeiger SQ","Zeiger Proj.",null,"Einteilung","Farbe",{"v":-0.3,"d":"-30%"},{"v":0,"d":"0%"}]
[null,"Zuwachs Projektion",{"$f":"'Zahlen Basis'!F6-'Zahlen Basis'!E6","v":{"v":51750,"d":"51,750"}},{"$f":"'Zahlen Basis'!J6-'Zahlen Basis'!I6","v":{"v":54949.54298703279,"d":"54,950"}},null,"Ausschlag links",{"$f":"IF(G15>30%,100%,IF(G15<-30%,0%,50%+G15*$N$16))","v":{"v":0.5047660655315844,"d":"50.5%"}},{"$f":"IF(H15>30%,100%,IF(H15<-30%,0%,50%+H15*$N$16))","v":{"v":0,"d":"0.0%"}},null,{"$f":"(100-J19)/2","v":{"v":45,"d":"45.0"}},"rot",{"v":0.3,"d":"30%"},{"v":1,"d":"100%"}]
[null,"Zielabweichung",{"$f":"C18-C17","v":{"v":-99768.56838255748,"d":"-99,769 "}},{"$f":"D18-D17","v":{"v":-109059.02826740686,"d":"-109,059 "}},null,"Zeiger",{"v":0,"d":"0.0%"},{"v":0,"d":"0.0%"},null,{"$f":"(Einstellungen!$D$11+Einstellungen!$D$11*$N$16)*2","v":{"v":10,"d":"10.0"}},"grün"]
[null,"Zielabweichung %",{"$f":"C19/C17*100","v":{"v":-65.84577022313171,"d":"-65.8 "}},{"$f":"D19/D17*100","v":{"v":-66.49593215357925,"d":"-66.5 "}},null,"Ausschlag rechts",{"$f":"1-G18","v":{"v":0.49523393446841557,"d":"49.5%"}},{"$f":"1-H18","v":{"v":1,"d":"100.0%"}},null,{"$f":"(100-J19)/2","v":{"v":45,"d":"45.0"}},"gelb"]
[{"$nulls":5},"Bodensegment",{"v":0.5,"d":"50.0%"},{"v":0.5,"d":"50.0%"},null,{"v":50,"d":"50.0"},"unsichtbar"]
[null,"Investitionsgrad"]
[null,null,"EUR","Prozent"]
[null,"Investiert:",{"$f":"Vermentw.!K14-Vermentw.!K11","v":{"v":6600000,"d":"6,600,000"}},{"$f":"C24/C26*100","v":{"v":86.8421052631579,"d":"86.8"}},"%"]
[null,"Kontoguthaben",{"$f":"Vermentw.!K11","v":{"v":1000000,"d":"1,000,000"}},{"$f":"C25/C26*100","v":{"v":13.157894736842104,"d":"13.2"}},"%"]
[null,"Summe",{"$f":"SUM(C24:C25)","v":{"v":7600000,"d":"7,600,000"}},{"$f":"SUM(D24:D25)","v":{"v":100.00000000000001,"d":"100.0"}},"%"]
[]
[null,"Erträge",{"$nulls":3},"Tacho Erträge"]
[null,null,{"$f":"'Daten Projektion'!I102","v":2019},{"$f":"'Daten Projektion'!M102","v":2023},null,"Ausgangswert",{"$f":"C33/100","v":{"v":-0.09753418571358051,"d":"-9.8%"}},{"$f":"D33/100","v":{"v":-0.08269197369206437,"d":"-8.3%"}}]
[null,"Ertragsziel:",{"$f":"'Daten Projektion'!I103","v":{"v":64822.4,"d":"64,822"}},{"$f":"'Daten Projektion'!M103","v":{"v":67148.01368911056,"d":"67,148"}},{"$nulls":5},"Segmente"]
[null,"Projektion:",{"$f":"'Daten Projektion'!I104","v":{"v":58500,"d":"58,500"}},{"$f":"'Daten Projektion'!M104","v":{"v":61595.41190765626,"d":"61,595"}},null,"Anzeige","Zeiger SQ","Zeiger Proj.",null,"Einteilung","Farbe"]
[null,"Abweichung EUR:",{"$f":"C31-C30","v":{"v":-6322.4000000000015,"d":"-6,322 "}},{"$f":"D31-D30","v":{"v":-5552.601781454308,"d":"-5,553 "}},null,"Ausschlag links",{"$f":"IF(G29>30%,100%,IF(G29<-30%,0%,50%+G29*$N$16))","v":{"v":0.3536987214296292,"d":"35.4%"}},{"$f":"IF(H29>30%,100%,IF(H29<-30%,0%,50%+H29*$N$16))","v":{"v":0.37596203946190343,"d":"37.6%"}},null,{"$f":"(100-J33)/2","v":{"v":45,"d":"45.0"}},"rot"]
[null,"Zielabweichung %",{"$f":"C32/C30*100","v":{"v":-9.75341857135805,"d":"-9.8 "}},{"$f":"D32/D30*100","v":{"v":-8.269197369206436,"d":"-8.3 "}},null,"Zeiger",{"v":0,"d":"0.0%"},{"v":0,"d":"0.0%"},null,{"$f":"(Einstellungen!$D$11+Einstellungen!$D$11*$N$16)*2","v":{"v":10,"d":"10.0"}},"grün"]
[{"$nulls":5},"Ausschlag rechts",{"$f":"1-G32","v":{"v":0.6463012785703708,"d":"64.6%"}},{"$f":"1-H32","v":{"v":0.6240379605380966,"d":"62.4%"}},null,{"$f":"(100-J33)/2","v":{"v":45,"d":"45.0"}},"gelb"]
[{"$nulls":5},"Bodensegment",{"v":0.5,"d":"50.0%"},{"v":0.5,"d":"50.0%"},null,{"v":50,"d":"50.0"},"unsichtbar"]
[]
[null,"Risiko",{"$nulls":3},"Tacho Risiko"]
[null,null,"InvestVerm.","Grundstock",null,"Ausgangswert",{"$f":"C42/100","v":{"v":-0.9038157894736842,"d":"-90.4%"}},{"$f":"D42/100","v":{"v":0,"d":"0.0%"}}]
[null,"Risikoziel",{"$f":"Vermentw.!K14*Anlageziele!E21*-1","v":{"v":-380000,"d":"-380,000 "}},{"$f":"'Daten VE'!D51*Anlageziele!E19*-1","v":0},{"$nulls":5},"Segmente"]
[null,"Projektion",{"$f":"MIN(M42:Q42,1)","v":{"v":-723450,"d":"-723,450 "}},{"$f":"IF(Vermentw.!K14-'Daten VE'!D51>C40,0,'Daten VE'!D51+(Vermentw.!K14-'Daten VE'!D51)-'Daten Cockpit '!C40)","v":0},null,"Anzeige","Investverm.","Grundstock",null,"Einteilung","Farbe",null,"Maximalverlust Projektion Worst Case"]
[null,"Abweichung EUR",{"$f":"(C40-C39)","v":{"v":-343450,"d":"-343,450 "}},{"$f":"(D40-D39)","v":0},null,"Ausschlag links",{"$f":"IF(G38>30%,100%,IF(G38<-30%,0%,50%+G38*$N$16))","v":{"v":0,"d":"0.0%"}},{"$f":"IF(H38>30%,100%,IF(H38<-30%,0%,50%+H38*$N$16))","v":{"v":0.5,"d":"50.0%"}},null,{"$f":"(100-J42)/2","v":{"v":45,"d":"45.0"}},"rot",null,{"$f":"'Daten Projektion'!I142","v":2019},{"$f":"'Daten Projektion'!J142","v":2020},{"$f":"'Daten Projektion'!K142","v":2021},{"$f":"'Daten Projektion'!L142","v":2022},{"$f":"'Daten Projektion'!M142","v":2023}]
[null,"Zielabweichung %",{"$f":"IF(C39=0,C41/1*-100,C41/C39*-100)","v":{"v":-90.38157894736842,"d":"-90.4 "}},{"$f":"IF(D39=0,D41/1*-100,D41/D39*-100)","v":{"v":0,"d":"0.0"}},null,"Zeiger",{"v":0,"d":"0.0%"},{"v":0,"d":"0.0%"},null,{"$f":"(Einstellungen!$D$11+Einstellungen!$D$11*$N$16)*2","v":{"v":10,"d":"10.0"}},"grün",null,{"$f":"'Daten Projektion'!I140-'Daten Projektion'!H140","v":{"v":51750,"d":"51,750"}},{"$f":"'Daten Projektion'!J140-'Daten Projektion'!I140","v":{"v":-723450,"d":"-723,450 "}},{"$f":"'Daten Projektion'!K140-'Daten Projektion'!J140","v":{"v":43882.75,"d":"43,883"}},{"$f":"'Daten Projektion'!L140-'Daten Projektion'!K140","v":{"v":44478.90125000011,"d":"44,479"}},{"$f":"'Daten Projektion'!M140-'Daten Projektion'!L140","v":{"v":45088.83038125001,"d":"45,089"}}]
[{"$nulls":5},"Ausschlag rechts",{"$f":"1-G41","v":{"v":1,"d":"100.0%"}},{"$f":"1-H41","v":{"v":0.5,"d":"50.0%"}},null,{"$f":"(100-J42)/2","v":{"v":45,"d":"45.0"}},"gelb"]
[{"$nulls":5},"Bodensegment",{"v":0.5,"d":"50.0%"},{"v":0.5,"d":"50.0%"},null,{"v":50,"d":"50.0"},"unsichtbar"]
[]
[null,"Nachhaltigkeit",{"$nulls":3},"Tacho Nachhaltigkeit"]
[null,{"$f":"Anlageziele!L19","v":2021},"Allgemein","Impact Inv.",{"$f":"Anlageziele!L22","v":"Best in Class"},"Ausgangswert",{"$f":"C51/100","v":{"v":0.16145848230132856,"d":"16.1%"}},{"$f":"D51/100","v":{"v":-1,"d":"-100.0%"}}]
[null,"Nachhaltigkeitsziel",{"$f":"SUMIF('Daten Projektion'!$I$164:$M$164,Anlageziele!$L$19,'Daten Projektion'!I175:M175)","v":{"v":5818186.8609375,"d":"5,818,187"}},{"$f":"SUMIF('Daten Projektion'!$I$164:$M$164,Anlageziele!$L$19,'Daten Projektion'!I174:M174)","v":{"v":775758.248125,"d":"775,758"}},{"$f":"SUMIF('Daten Projektion'!$I$164:$M$164,Anlageziele!$L$19,'Daten Projektion'!$I$173:$M$173)","v":{"v":775758.248125,"d":"775,758"}},{"$nulls":4},"Segmente"]
[null,"Projektion",{"$f":"SUMIF('Daten Projektion'!$I$164:$M$164,Anlageziele!$L$19,'Daten Projektion'!I170:M170)","v":{"v":6757582.48125,"d":"6,757,582"}},{"$f":"SUMIF('Daten Projektion'!$I$164:$M$164,Anlageziele!$L$19,'Daten Projektion'!I169:M169)","v":0},{"$f":"SUMIF('Daten Projektion'!$I$164:$M$164,Anlageziele!$L$19,'Daten Projektion'!I172:M172)","v":{"v":5278390.65,"d":"5,278,391"}},"Anzeige","Zeiger ESG","Zeiger Imp.",null,"Einteilung","Farbe"]
[null,"Abweichung EUR",{"$f":"C49-C48","v":{"v":939395.6203124998,"d":"939,396"}},{"$f":"D49-D48","v":{"v":-775758.248125,"d":"-775,758 "}},{"v":4502632.401875,"d":"4,502,632"},"Ausschlag links",{"$f":"IF(G47>30%,100%,IF(G47<-30%,0%,50%+G47*$N$16))","v":{"v":0.7421877234519929,"d":"74.2%"}},{"$f":"IF(H47>30%,100%,IF(H47<-30%,0%,50%+H47*$N$16))","v":{"v":0,"d":"0.0%"}},null,{"$f":"(100-J51)/2","v":{"v":45,"d":"45.0"}},"rot"]
[null,"Zielabweichung %",{"$f":"C50/C48*100","v":{"v":16.145848230132856,"d":"16.1"}},{"$f":"D50/D48*100","v":{"v":-100,"d":"-100.0 "}},{"v":580.4169549931075,"d":"580.4"},"Zeiger",{"v":0,"d":"0.0%"},{"v":0,"d":"0.0%"},null,{"$f":"(Einstellungen!$D$11+Einstellungen!$D$11*$N$16)*2","v":{"v":10,"d":"10.0"}},"grün"]
[{"$nulls":5},"Ausschlag rechts",{"$f":"1-G50","v":{"v":0.2578122765480071,"d":"25.8%"}},{"$f":"1-H50","v":{"v":1,"d":"100.0%"}},null,{"$f":"(100-J51)/2","v":{"v":45,"d":"45.0"}},"gelb"]
[null,"Cockpit-Grafik Nachhaltigkeit",null,{"$f":"Anlageziele!L19","v":2021},null,"Bodensegment",{"v":0.5,"d":"50.0%"},{"v":0.5,"d":"50.0%"},null,{"v":50,"d":"50.0"},"unsichtbar"]
[]
[null,null,"Ziel","Projektion"]
[null,"\"Blind eye\"",{"$f":"C62-D62","v":{"v":-1939395.6203124998,"d":"-1,939,396 "}},{"$f":"(D62-SUM(D57:D61))*-1","v":{"v":-1000000,"d":"-1,000,000 "}}]
[null,{"$f":"'Daten Projektion'!G166","v":"Zweckkonform"},{"$f":"C62-SUM(C59:C61)","v":{"v":4266670.3646875005,"d":"4,266,670"}},{"$f":"SUMIF('Daten Projektion'!$I$164:$M$164,Anlageziele!L$19,'Daten Projektion'!I166:M166)","v":{"v":515150.5,"d":"515,151"}}]
[null,"Ausschluss",{"$f":"IF(B58=Anlageziele!$L$22,SUMIF('Daten Projektion'!$I$164:$M$164,Anlageziele!$L$19,'Daten Projektion'!$I$173:$M$173),0)","v":0},{"$f":"SUMIF('Daten Projektion'!$I$164:$M$164,Anlageziele!L$19,'Daten Projektion'!I165:M165)","v":{"v":253768.78125,"d":"253,769"}}]
[null,{"$f":"'Daten Projektion'!G167","v":"Best in Class"},{"$f":"IF(B59=Anlageziele!$L$22,SUMIF('Daten Projektion'!$I$164:$M$164,Anlageziele!$L$19,'Daten Projektion'!$I$173:$M$173),0)","v":{"v":775758.248125,"d":"775,758"}},{"$f":"SUMIF('Daten Projektion'!$I$164:$M$164,Anlageziele!L$19,'Daten Projektion'!I167:M167)","v":{"v":5278390.65,"d":"5,278,391"}}]
[null,{"$f":"'Daten Projektion'!G168","v":"Engagement"},{"$f":"IF(B60=Anlageziele!$L$22,SUMIF('Daten Projektion'!$I$164:$M$164,Anlageziele!$L$19,'Daten Projektion'!$I$173:$M$173),0)","v":0},{"$f":"SUMIF('Daten Projektion'!$I$164:$M$164,Anlageziele!L$19,'Daten Projektion'!I168:M168)","v":{"v":710272.55,"d":"710,273"}}]
[null,{"$f":"'Daten Projektion'!G169","v":"Impact Investing"},{"$f":"SUMIF('Daten Projektion'!$I$164:$M$164,Anlageziele!$L$19,'Daten Projektion'!I174:M174)","v":{"v":775758.248125,"d":"775,758"}},{"$f":"SUMIF('Daten Projektion'!$I$164:$M$164,Anlageziele!L$19,'Daten Projektion'!I169:M169)","v":0}]
[null,"Summe",{"$f":"SUMIF('Daten Projektion'!$I$164:$M$164,Anlageziele!$L$19,'Daten Projektion'!$I$175:$M$175)","v":{"v":5818186.8609375,"d":"5,818,187"}},{"$f":"SUMIF('Daten Projektion'!$I$164:$M$164,Anlageziele!L$19,'Daten Projektion'!I18:M18)","v":{"v":7757582.48125,"d":"7,757,582"}}]

{"sheet":"Vermentw.","index":6,"n_rows":17,"n_cols":13,"rows_kept":17}
[]
[]
[]
[null,"Nr.","Vermögensgegenstand (Bezeichnung)","Wert EUR","Anlageklasse","Instrument","UV","Nachhaltigkeit"]
[null,1,"Vermögensverwaltung A-Bank Aktien",{"v":650000,"d":"650,000"},"Aktien","VV-Mandat",null,"Engagement",null,"Vermögen nach Anlageklassen:"]
[null,{"$f":"B5+1","v":2},"Vermögensverwaltung A-Bank Renten",{"v":5200000,"d":"5,200,000"},"Renten","VV-Mandat",null,"Best in Class",null,"Immobilien",{"$f":"SUMIF($E$5:$E$16,\"immobilien\",$D$5:$D$16)","v":{"v":500000,"d":"500,000"}},{"$f":"IF(Einstellungen!$D$9=\"TEUR\",\"TEUR\",\"EUR\")","v":"EUR"},{"$f":"K6/$K$14","v":{"v":0.06578947368421052,"d":"6.6%"}}]
[null,{"$f":"B6+1","v":3},"Stiftungsfonds Xy",{"v":250000,"d":"250,000"},"Renten","Fonds",null,"Ausschluss",null,"Beteiligungen",{"$f":"SUMIF($E$5:$E$16,\"Beteiligungen\",$D$5:$D$16)","v":0},{"$f":"IF(Einstellungen!$D$9=\"TEUR\",\"TEUR\",\"EUR\")","v":"EUR"},{"v":0,"d":"0.0%"}]
[null,4,"Immobilie",{"v":500000,"d":"500,000"},"Immobilien","Direktanlage",null,"Zweckkonform",null,"Aktien",{"$f":"SUMIF($E$5:$E$16,\"Aktien\",$D$5:$D$16)","v":{"v":650000,"d":"650,000"}},{"$f":"IF(Einstellungen!$D$9=\"TEUR\",\"TEUR\",\"EUR\")","v":"EUR"},{"v":0.08552631578947369,"d":"8.6%"}]
[null,5,"Bankguthaben B-Bank",{"v":1000000,"d":"1,000,000"},"Kontoguthaben","Direktanlage",null,"Keine",null,"Renten",{"$f":"SUMIF($E$5:$E$16,\"Renten\",$D$5:$D$16)","v":{"v":5450000,"d":"5,450,000"}},{"$f":"IF(Einstellungen!$D$9=\"TEUR\",\"TEUR\",\"EUR\")","v":"EUR"},{"v":0.7171052631578947,"d":"71.7%"}]
[null,6,null,null,"Bitte auswählen","Bitte auswählen",null,"Bitte ausw.",null,"Spar- u. Termineinlagen",{"$f":"SUMIF($E$5:$E$16,\"Spar- u. Termineinlagen\",$D$5:$D$16)","v":0},{"$f":"IF(Einstellungen!$D$9=\"TEUR\",\"TEUR\",\"EUR\")","v":"EUR"},{"v":0,"d":"0.0%"}]
[null,7,null,null,"Bitte auswählen","Bitte auswählen",null,"Bitte ausw.",null,"Kontoguthaben",{"$f":"SUMIF($E$5:$E$16,\"Kontoguthaben\",$D$5:$D$16)","v":{"v":1000000,"d":"1,000,000"}},"EUR",{"v":0.13157894736842105,"d":"13.2%"}]
[null,8,null,null,"Bitte auswählen","Bitte auswählen",null,"Bitte ausw.",null,"Sonstiges Vermögen",{"$f":"SUMIF($E$5:$E$16,\"Sonstiges Vermögen\",$D$5:$D$16)","v":0},{"$f":"IF(Einstellungen!$D$9=\"TEUR\",\"TEUR\",\"EUR\")","v":"EUR"},{"v":0,"d":"0.0%"}]
[null,9,null,null,"Bitte auswählen","Bitte auswählen",null,"Bitte ausw.",null,"Verbindlichkeiten",{"$f":"SUMIF($E$5:$E$16,\"Verbindlichkeiten\",$D$5:$D$16)*-1","v":0},{"$f":"IF(Einstellungen!$D$9=\"TEUR\",\"TEUR\",\"EUR\")","v":"EUR"},{"v":0,"d":"0.0%"}]
[null,10,null,null,"Bitte auswählen","Bitte auswählen",null,"Bitte ausw.",null,"Gesamt",{"$f":"SUM(K6:K13)","v":{"v":7600000,"d":"7,600,000"}},{"$f":"IF(Einstellungen!$D$9=\"TEUR\",\"TEUR\",\"EUR\")","v":"EUR"},{"v":1,"d":"100.0%"}]
[null,11,null,null,"Bitte auswählen","Bitte auswählen",null,"Bitte ausw."]
[null,12,null,null,"Bitte auswählen","Bitte auswählen",null,"Bitte ausw."]
[null,"--- Ende der Eingaben ---"]

{"sheet":"Daten Vermögen","index":7,"n_rows":26,"n_cols":11,"rows_kept":26,"hidden":true}
["Datenblatt Investitionsvermögen"]
[]
[]
[null,"Anlageklassen","Anlageinstrument","Nr.","Umschichtungsverbot","Nachhaltigkeit",null,{"$f":"Vermentw.!B4","v":"Nr."},{"$f":"Vermentw.!C4","v":"Vermögensgegenstand (Bezeichnung)"},{"$f":"Vermentw.!D4","v":"Wert EUR"},{"$f":"Vermentw.!H4","v":"Nachhaltigkeit"}]
[null,"Bitte auswählen","Bitte auswählen",{"$f":"Vermentw.!B5","v":1},false,"Bitte ausw.",null,{"$f":"Vermentw.!B5","v":1},{"$f":"Vermentw.!C5","v":"Vermögensverwaltung A-Bank Aktien"},{"$f":"Vermentw.!D5","v":{"v":650000,"d":"650,000"}},{"$f":"Vermentw.!H5","v":"Engagement"}]
[null,"Immobilien","Direktanlage",{"$f":"Vermentw.!B6","v":2},false,"Keine",null,{"$f":"Vermentw.!B6","v":2},{"$f":"Vermentw.!C6","v":"Vermögensverwaltung A-Bank Renten"},{"$f":"Vermentw.!D6","v":{"v":5200000,"d":"5,200,000"}},{"$f":"Vermentw.!H6","v":"Best in Class"}]
[null,"Beteiligungen","VV-Mandat",{"$f":"Vermentw.!B7","v":3},false,"Zweckkonform",null,{"$f":"Vermentw.!B7","v":3},{"$f":"Vermentw.!C7","v":"Stiftungsfonds Xy"},{"$f":"Vermentw.!D7","v":{"v":250000,"d":"250,000"}},{"$f":"Vermentw.!H7","v":"Ausschluss"}]
[null,"Aktien","Fonds",{"$f":"Vermentw.!B8","v":4},true,"Ausschluss",null,{"$f":"Vermentw.!B8","v":4},{"$f":"Vermentw.!C8","v":"Immobilie"},{"$f":"Vermentw.!D8","v":{"v":500000,"d":"500,000"}},{"$f":"Vermentw.!H8","v":"Zweckkonform"}]
[null,"Renten",null,{"$f":"Vermentw.!B9","v":5},false,"Best in Class",null,{"$f":"Vermentw.!B9","v":5},{"$f":"Vermentw.!C9","v":"Bankguthaben B-Bank"},{"$f":"Vermentw.!D9","v":{"v":1000000,"d":"1,000,000"}},{"$f":"Vermentw.!H9","v":"Keine"}]
[null,"Spar- u. Termineinlagen",null,{"$f":"Vermentw.!B10","v":6},false,"Engagement",null,{"$f":"Vermentw.!B10","v":6},{"$f":"Vermentw.!C10","v":0},{"$f":"Vermentw.!D10","v":0},{"$f":"Vermentw.!H10","v":"Bitte ausw."}]
[null,"Kontoguthaben",null,{"$f":"Vermentw.!B11","v":7},false,"Impact Investing",null,{"$f":"Vermentw.!B11","v":7},{"$f":"Vermentw.!C11","v":0},{"$f":"Vermentw.!D11","v":0},{"$f":"Vermentw.!H11","v":"Bitte ausw."}]
[null,"Sonstiges Vermögen",null,{"$f":"Vermentw.!B12","v":8},false,null,null,{"$f":"Vermentw.!B12","v":8},{"$f":"Vermentw.!C12","v":0},{"$f":"Vermentw.!D12","v":0},{"$f":"Vermentw.!H12","v":"Bitte ausw."}]
[null,"Verbindlichkeiten",null,{"$f":"Vermentw.!B13","v":9},false,null,null,{"$f":"Vermentw.!B13","v":9},{"$f":"Vermentw.!C13","v":0},{"$f":"Vermentw.!D13","v":0},{"$f":"Vermentw.!H13","v":"Bitte ausw."}]
[{"$nulls":3},{"$f":"Vermentw.!B14","v":10},false,null,null,{"$f":"Vermentw.!B14","v":10},{"$f":"Vermentw.!C14","v":0},{"$f":"Vermentw.!D14","v":0},{"$f":"Vermentw.!H14","v":"Bitte ausw."}]
[{"$nulls":3},{"$f":"Vermentw.!B15","v":11},false,null,null,{"$f":"Vermentw.!B15","v":11},{"$f":"Vermentw.!C15","v":0},{"$f":"Vermentw.!D15","v":0},{"$f":"Vermentw.!H15","v":"Bitte ausw."}]
[{"$nulls":3},{"$f":"Vermentw.!B16","v":12},false,null,null,{"$f":"Vermentw.!B16","v":12},{"$f":"Vermentw.!C16","v":0},{"$f":"Vermentw.!D16","v":0},{"$f":"Vermentw.!H16","v":"Bitte ausw."}]
[{"$nulls":8},"Summe",{"$f":"SUM(J5:J16)","v":{"v":7600000,"d":"7,600,000"}}]
[]
[{"$nulls":8},"Summen nach Nachhaltigkeitskriterien"]
[{"$nulls":8},"Keine",{"$f":"K20/$K$26","v":{"v":0.13157894736842105,"d":"13.2%"}},{"$f":"SUMIF($K$5:$K$16,I20,$J$5:$J$16)","v":{"v":1000000,"d":"1,000,000"}}]
[{"$nulls":8},"Zweckkonform",{"$f":"K21/$K$26","v":{"v":0.06578947368421052,"d":"6.6%"}},{"v":500000,"d":"500,000"}]
[{"$nulls":8},"Ausschluss",{"v":0.03289473684210526,"d":"3.3%"},{"v":250000,"d":"250,000"}]
[{"$nulls":8},"Best in Class",{"v":0.6842105263157895,"d":"68.4%"},{"v":5200000,"d":"5,200,000"}]
[{"$nulls":8},"Engagement",{"v":0.08552631578947369,"d":"8.6%"},{"v":650000,"d":"650,000"}]
[{"$nulls":8},"Impact Investing",{"v":0,"d":"0.0%"},0]
[{"$nulls":8},"Summe",{"v":1,"d":"100.0%"},{"$f":"SUM(K20:K25)","v":{"v":7600000,"d":"7,600,000"}}]

{"sheet":"Vermerh.","index":8,"n_rows":35,"n_cols":4,"rows_kept":35}
[]
[]
[]
[]
[" ","Betrag","Währung","Gründungsjahr"]
[null,{"v":5500000,"d":"5,500,000"},"EUR",{"$f":"Einstellungen!D6","v":2001}]
[null,"Vermögenserhaltung: ",{"$f":"Anlageziele!E5","v":"Real"},"DM"]
[null,null," "]
[]
[null,"Betrag","Währung","Jahr    "]
[null,{"v":500000,"d":"500,000"},"EUR",2009]
[null,0,"EUR",2003]
[null,0,"EUR",2005]
[null,0,"EUR",2007]
[null,0,"EUR",2008]
[]
[]
[]
[null,"Betrag","Währung","Jahr"]
[null,0,"EUR",2002]
[null,0,"EUR",2004]
[null,0,"EUR",2006]
[null,0,"EUR",2002]
[null,0,"EUR",2002]
[]
[]
[]
[null,"Betrag","Wärung","Jahr"]
[null,0,"EUR",2009]
[null,0,"EUR",2010]
[null,0,"EUR",2011]
[null,0,"EUR",2000]
[null,0,"EUR",2000]
[]
[null,"--- Ende der Eingaben ---"]

{"sheet":"Daten VE","index":9,"n_rows":56,"n_cols":18,"rows_kept":56,"hidden":true}
["Daten Vermögenserhaltung"]
[]
[{"$nulls":3},"Inflationsraten in Deutschland von 1992 bis 2018"]
[{"$nulls":3},"(Veränderung des Verbraucherpreisindex gegenüber Vorjahr)"]
[null,"Währung","Jahre für Auswahlfeld","Jahr","VPI","Ausstattung","Zustiftung","Zuschreibung","Abschreibung","Nominalwert","Realwert","Verbrauch","Grundstock nom.:",{"$f":"SUM(N6:N32)","v":{"v":6000000,"d":"6,000,000"}},null,null,"VPI lfd. Jahr"]
[null,"EUR","Bitte auswählen",1992,{"v":0.051,"d":"5.1%"},{"$f":"IF($D6=Vermerh.!$D$6,$N$6,0)","v":0},{"$f":"IF(D6=Vermerh.!$D$11,$N$11,0)+IF(D6=Vermerh.!$D$12,$N$12,0)+IF(D6=Vermerh.!$D$13,$N$13,0)+IF(D6=Vermerh.!$D$14,$N$14,0)+IF(D6=Vermerh.!$D$15,$N$15,0)","v":0},{"$f":"IF(D6=Vermerh.!$D$20,$N$19,0)+IF(D6=Vermerh.!$D$21,$N$20,0)+IF(D6=Vermerh.!$D$22,$N$21,0)+IF(D6=Vermerh.!$D$23,$N$22,0)+IF(D6=Vermerh.!$D$24,$N$23,0)","v":0},{"$f":"IF(D6=Vermerh.!$D$29,$N$28,0)+IF(D6=Vermerh.!$D$30,$N$29,0)+IF(D6=Vermerh.!$D$31,$N$30,0)+IF(D6=Vermerh.!$D$32,$N$31,0)+IF(D6=Vermerh.!$D$33,$N$32,0)","v":0},{"$f":"SUM(F6:I6)","v":0},{"$f":"SUM(F6:I6)","v":0},{"$f":"IF(D6=Einstellungen!$D$6,'Daten VE'!K6,IF(D6>Einstellungen!$D$6,'Daten VE'!L5+L5*E6-IF(Anlageziele!$E$12='Daten Einstellg_Ziele'!$C$19,Anlageziele!$E$13,Vermerh.!$B$6/Anlageziele!$E$13),0))","v":0},"Ausstattung:",{"$f":"IF(Vermerh.!C6=\"EUR\",Vermerh.!B6,Vermerh.!B6/1.95583)","v":{"v":5500000,"d":"5,500,000"}},null,null,"Jan",1.6]
[null,"DM",{"$f":"Einstellungen!D6","v":2001},1993,{"v":0.045,"d":"4.5%"},{"$f":"IF($D7=Vermerh.!$D$6,$N$6,0)","v":0},{"$f":"IF(D7=Vermerh.!$D$11,$N$11,0)+IF(D7=Vermerh.!$D$12,$N$12,0)+IF(D7=Vermerh.!$D$13,$N$13,0)+IF(D7=Vermerh.!$D$14,$N$14,0)+IF(D7=Vermerh.!$D$15,$N$15,0)","v":0},{"$f":"IF(D7=Vermerh.!$D$20,$N$19,0)+IF(D7=Vermerh.!$D$21,$N$20,0)+IF(D7=Vermerh.!$D$22,$N$21,0)+IF(D7=Vermerh.!$D$23,$N$22,0)+IF(D7=Vermerh.!$D$24,$N$23,0)","v":0},{"$f":"IF(D7=Vermerh.!$D$29,$N$28,0)+IF(D7=Vermerh.!$D$30,$N$29,0)+IF(D7=Vermerh.!$D$31,$N$30,0)+IF(D7=Vermerh.!$D$32,$N$31,0)+IF(D7=Vermerh.!$D$33,$N$32,0)","v":0},{"$f":"J6+SUM(F7:I7)","v":0},{"$f":"K6+K6*E7+SUM(F7:I7)","v":0},{"$f":"IF(D7=Einstellungen!$D$6,'Daten VE'!K7,IF(D7>Einstellungen!$D$6,'Daten VE'!L6+L6*E7-IF(Anlageziele!$E$12='Daten Einstellg_Ziele'!$C$19,Anlageziele!$E$13,Vermerh.!$B$6/Anlageziele!$E$13),0))","v":0},{"$nulls":4},"Feb",1.4]
[null,null,{"$f":"IF(C7=\"\",\"\",IF(C7=Einstellungen!$D$7-1,\"\",'Daten VE'!C7+1))","v":2002},1994,{"v":0.026,"d":"2.6%"},{"$f":"IF($D8=Vermerh.!$D$6,$N$6,0)","v":0},{"$f":"IF(D8=Vermerh.!$D$11,$N$11,0)+IF(D8=Vermerh.!$D$12,$N$12,0)+IF(D8=Vermerh.!$D$13,$N$13,0)+IF(D8=Vermerh.!$D$14,$N$14,0)+IF(D8=Vermerh.!$D$15,$N$15,0)","v":0},{"$f":"IF(D8=Vermerh.!$D$20,$N$19,0)+IF(D8=Vermerh.!$D$21,$N$20,0)+IF(D8=Vermerh.!$D$22,$N$21,0)+IF(D8=Vermerh.!$D$23,$N$22,0)+IF(D8=Vermerh.!$D$24,$N$23,0)","v":0},{"$f":"IF(D8=Vermerh.!$D$29,$N$28,0)+IF(D8=Vermerh.!$D$30,$N$29,0)+IF(D8=Vermerh.!$D$31,$N$30,0)+IF(D8=Vermerh.!$D$32,$N$31,0)+IF(D8=Vermerh.!$D$33,$N$32,0)","v":0},{"$f":"J7+SUM(F8:I8)","v":0},{"$f":"K7+K7*E8+SUM(F8:I8)","v":0},{"$f":"IF(D8=Einstellungen!$D$6,'Daten VE'!K8,IF(D8>Einstellungen!$D$6,'Daten VE'!L7+L7*E8-IF(Anlageziele!$E$12='Daten Einstellg_Ziele'!$C$19,Anlageziele!$E$13,Vermerh.!$B$6/Anlageziele!$E$13),0))","v":0},{"$nulls":4},"Mär",1.6]
[null,null,{"$f":"IF(C8=\"\",\"\",IF(C8=Einstellungen!$D$7-1,\"\",'Daten VE'!C8+1))","v":2003},1995,{"v":0.018,"d":"1.8%"},{"$f":"IF($D9=Vermerh.!$D$6,$N$6,0)","v":0},{"$f":"IF(D9=Vermerh.!$D$11,$N$11,0)+IF(D9=Vermerh.!$D$12,$N$12,0)+IF(D9=Vermerh.!$D$13,$N$13,0)+IF(D9=Vermerh.!$D$14,$N$14,0)+IF(D9=Vermerh.!$D$15,$N$15,0)","v":0},{"$f":"IF(D9=Vermerh.!$D$20,$N$19,0)+IF(D9=Vermerh.!$D$21,$N$20,0)+IF(D9=Vermerh.!$D$22,$N$21,0)+IF(D9=Vermerh.!$D$23,$N$22,0)+IF(D9=Vermerh.!$D$24,$N$23,0)","v":0},{"$f":"IF(D9=Vermerh.!$D$29,$N$28,0)+IF(D9=Vermerh.!$D$30,$N$29,0)+IF(D9=Vermerh.!$D$31,$N$30,0)+IF(D9=Vermerh.!$D$32,$N$31,0)+IF(D9=Vermerh.!$D$33,$N$32,0)","v":0},0,0,{"$f":"IF(D9=Einstellungen!$D$6,'Daten VE'!K9,IF(D9>Einstellungen!$D$6,'Daten VE'!L8+L8*E9-IF(Anlageziele!$E$12='Daten Einstellg_Ziele'!$C$19,Anlageziele!$E$13,Vermerh.!$B$6/Anlageziele!$E$13),0))","v":0},{"$nulls":4},"Apr",1.6]
[null,null,{"$f":"IF(C9=\"\",\"\",IF(C9=Einstellungen!$D$7-1,\"\",'Daten VE'!C9+1))","v":2004},1996,{"v":0.014,"d":"1.4%"},{"$f":"IF($D10=Vermerh.!$D$6,$N$6,0)","v":0},{"$f":"IF(D10=Vermerh.!$D$11,$N$11,0)+IF(D10=Vermerh.!$D$12,$N$12,0)+IF(D10=Vermerh.!$D$13,$N$13,0)+IF(D10=Vermerh.!$D$14,$N$14,0)+IF(D10=Vermerh.!$D$15,$N$15,0)","v":0},{"$f":"IF(D10=Vermerh.!$D$20,$N$19,0)+IF(D10=Vermerh.!$D$21,$N$20,0)+IF(D10=Vermerh.!$D$22,$N$21,0)+IF(D10=Vermerh.!$D$23,$N$22,0)+IF(D10=Vermerh.!$D$24,$N$23,0)","v":0},{"$f":"IF(D10=Vermerh.!$D$29,$N$28,0)+IF(D10=Vermerh.!$D$30,$N$29,0)+IF(D10=Vermerh.!$D$31,$N$30,0)+IF(D10=Vermerh.!$D$32,$N$31,0)+IF(D10=Vermerh.!$D$33,$N$32,0)","v":0},0,0,{"$f":"IF(D10=Einstellungen!$D$6,'Daten VE'!K10,IF(D10>Einstellungen!$D$6,'Daten VE'!L9+L9*E10-IF(Anlageziele!$E$12='Daten Einstellg_Ziele'!$C$19,Anlageziele!$E$13,Vermerh.!$B$6/Anlageziele!$E$13),0))","v":0},{"$nulls":4},"Mai",2.2]
[null,null,{"$f":"IF(C10=\"\",\"\",IF(C10=Einstellungen!$D$7-1,\"\",'Daten VE'!C10+1))","v":2005},1997,{"v":0.02,"d":"2.0%"},{"$f":"IF($D11=Vermerh.!$D$6,$N$6,0)","v":0},{"$f":"IF(D11=Vermerh.!$D$11,$N$11,0)+IF(D11=Vermerh.!$D$12,$N$12,0)+IF(D11=Vermerh.!$D$13,$N$13,0)+IF(D11=Vermerh.!$D$14,$N$14,0)+IF(D11=Vermerh.!$D$15,$N$15,0)","v":0},{"$f":"IF(D11=Vermerh.!$D$20,$N$19,0)+IF(D11=Vermerh.!$D$21,$N$20,0)+IF(D11=Vermerh.!$D$22,$N$21,0)+IF(D11=Vermerh.!$D$23,$N$22,0)+IF(D11=Vermerh.!$D$24,$N$23,0)","v":0},{"$f":"IF(D11=Vermerh.!$D$29,$N$28,0)+IF(D11=Vermerh.!$D$30,$N$29,0)+IF(D11=Vermerh.!$D$31,$N$30,0)+IF(D11=Vermerh.!$D$32,$N$31,0)+IF(D11=Vermerh.!$D$33,$N$32,0)","v":0},0,0,{"$f":"IF(D11=Einstellungen!$D$6,'Daten VE'!K11,IF(D11>Einstellungen!$D$6,'Daten VE'!L10+L10*E11-IF(Anlageziele!$E$12='Daten Einstellg_Ziele'!$C$19,Anlageziele!$E$13,Vermerh.!$B$6/Anlageziele!$E$13),0))","v":0},"Zustiftungen:",{"$f":"IF(Tabelle1[[#This Row],[Währung]]=\"EUR\",Tabelle1[[#This Row],[Betrag]],Tabelle1[[#This Row],[Betrag]]/1.95583)","v":{"v":500000,"d":"500,000"}},null,null,"Jun",2.1]
[null,null,{"$f":"IF(C11=\"\",\"\",IF(C11=Einstellungen!$D$7-1,\"\",'Daten VE'!C11+1))","v":2006},1998,{"v":0.01,"d":"1.0%"},{"$f":"IF($D12=Vermerh.!$D$6,$N$6,0)","v":0},{"$f":"IF(D12=Vermerh.!$D$11,$N$11,0)+IF(D12=Vermerh.!$D$12,$N$12,0)+IF(D12=Vermerh.!$D$13,$N$13,0)+IF(D12=Vermerh.!$D$14,$N$14,0)+IF(D12=Vermerh.!$D$15,$N$15,0)","v":0},{"$f":"IF(D12=Vermerh.!$D$20,$N$19,0)+IF(D12=Vermerh.!$D$21,$N$20,0)+IF(D12=Vermerh.!$D$22,$N$21,0)+IF(D12=Vermerh.!$D$23,$N$22,0)+IF(D12=Vermerh.!$D$24,$N$23,0)","v":0},{"$f":"IF(D12=Vermerh.!$D$29,$N$28,0)+IF(D12=Vermerh.!$D$30,$N$29,0)+IF(D12=Vermerh.!$D$31,$N$30,0)+IF(D12=Vermerh.!$D$32,$N$31,0)+IF(D12=Vermerh.!$D$33,$N$32,0)","v":0},0,0,{"$f":"IF(D12=Einstellungen!$D$6,'Daten VE'!K12,IF(D12>Einstellungen!$D$6,'Daten VE'!L11+L11*E12-IF(Anlageziele!$E$12='Daten Einstellg_Ziele'!$C$19,Anlageziele!$E$13,Vermerh.!$B$6/Anlageziele!$E$13),0))","v":0},null,{"$f":"IF(Tabelle1[[#This Row],[Währung]]=\"EUR\",Tabelle1[[#This Row],[Betrag]],Tabelle1[[#This Row],[Betrag]]/1.95583)","v":0},null,null,"Jul",{"v":2,"d":"2.0"}]
[null,null,{"$f":"IF(C12=\"\",\"\",IF(C12=Einstellungen!$D$7-1,\"\",'Daten VE'!C12+1))","v":2007},1999,{"v":0.006,"d":"0.6%"},{"$f":"IF($D13=Vermerh.!$D$6,$N$6,0)","v":0},{"$f":"IF(D13=Vermerh.!$D$11,$N$11,0)+IF(D13=Vermerh.!$D$12,$N$12,0)+IF(D13=Vermerh.!$D$13,$N$13,0)+IF(D13=Vermerh.!$D$14,$N$14,0)+IF(D13=Vermerh.!$D$15,$N$15,0)","v":0},{"$f":"IF(D13=Vermerh.!$D$20,$N$19,0)+IF(D13=Vermerh.!$D$21,$N$20,0)+IF(D13=Vermerh.!$D$22,$N$21,0)+IF(D13=Vermerh.!$D$23,$N$22,0)+IF(D13=Vermerh.!$D$24,$N$23,0)","v":0},{"$f":"IF(D13=Vermerh.!$D$29,$N$28,0)+IF(D13=Vermerh.!$D$30,$N$29,0)+IF(D13=Vermerh.!$D$31,$N$30,0)+IF(D13=Vermerh.!$D$32,$N$31,0)+IF(D13=Vermerh.!$D$33,$N$32,0)","v":0},0,0,{"$f":"IF(D13=Einstellungen!$D$6,'Daten VE'!K13,IF(D13>Einstellungen!$D$6,'Daten VE'!L12+L12*E13-IF(Anlageziele!$E$12='Daten Einstellg_Ziele'!$C$19,Anlageziele!$E$13,Vermerh.!$B$6/Anlageziele!$E$13),0))","v":0},null,{"$f":"IF(Tabelle1[[#This Row],[Währung]]=\"EUR\",Tabelle1[[#This Row],[Betrag]],Tabelle1[[#This Row],[Betrag]]/1.95583)","v":0},null,null,"Aug",{"v":2,"d":"2.0"}]
[null,null,{"$f":"IF(C13=\"\",\"\",IF(C13=Einstellungen!$D$7-1,\"\",'Daten VE'!C13+1))","v":2008},2000,{"v":0.014,"d":"1.4%"},{"$f":"IF($D14=Vermerh.!$D$6,$N$6,0)","v":0},{"$f":"IF(D14=Vermerh.!$D$11,$N$11,0)+IF(D14=Vermerh.!$D$12,$N$12,0)+IF(D14=Vermerh.!$D$13,$N$13,0)+IF(D14=Vermerh.!$D$14,$N$14,0)+IF(D14=Vermerh.!$D$15,$N$15,0)","v":0},{"$f":"IF(D14=Vermerh.!$D$20,$N$19,0)+IF(D14=Vermerh.!$D$21,$N$20,0)+IF(D14=Vermerh.!$D$22,$N$21,0)+IF(D14=Vermerh.!$D$23,$N$22,0)+IF(D14=Vermerh.!$D$24,$N$23,0)","v":0},{"$f":"IF(D14=Vermerh.!$D$29,$N$28,0)+IF(D14=Vermerh.!$D$30,$N$29,0)+IF(D14=Vermerh.!$D$31,$N$30,0)+IF(D14=Vermerh.!$D$32,$N$31,0)+IF(D14=Vermerh.!$D$33,$N$32,0)","v":0},0,0,{"$f":"IF(D14=Einstellungen!$D$6,'Daten VE'!K14,IF(D14>Einstellungen!$D$6,'Daten VE'!L13+L13*E14-IF(Anlageziele!$E$12='Daten Einstellg_Ziele'!$C$19,Anlageziele!$E$13,Vermerh.!$B$6/Anlageziele!$E$13),0))","v":0},null,{"$f":"IF(Tabelle1[[#This Row],[Währung]]=\"EUR\",Tabelle1[[#This Row],[Betrag]],Tabelle1[[#This Row],[Betrag]]/1.95583)","v":0},null,null,"Sep",2.3]
[null,null,{"$f":"IF(C14=\"\",\"\",IF(C14=Einstellungen!$D$7-1,\"\",'Daten VE'!C14+1))","v":2009},2001,{"v":0.02,"d":"2.0%"},{"$f":"IF($D15=Vermerh.!$D$6,$N$6,0)","v":{"v":5500000,"d":"5,500,000"}},{"$f":"IF(D15=Vermerh.!$D$11,$N$11,0)+IF(D15=Vermerh.!$D$12,$N$12,0)+IF(D15=Vermerh.!$D$13,$N$13,0)+IF(D15=Vermerh.!$D$14,$N$14,0)+IF(D15=Vermerh.!$D$15,$N$15,0)","v":0},{"$f":"IF(D15=Vermerh.!$D$20,$N$19,0)+IF(D15=Vermerh.!$D$21,$N$20,0)+IF(D15=Vermerh.!$D$22,$N$21,0)+IF(D15=Vermerh.!$D$23,$N$22,0)+IF(D15=Vermerh.!$D$24,$N$23,0)","v":0},{"$f":"IF(D15=Vermerh.!$D$29,$N$28,0)+IF(D15=Vermerh.!$D$30,$N$29,0)+IF(D15=Vermerh.!$D$31,$N$30,0)+IF(D15=Vermerh.!$D$32,$N$31,0)+IF(D15=Vermerh.!$D$33,$N$32,0)","v":0},{"v":5500000,"d":"5,500,000"},{"v":5500000,"d":"5,500,000"},{"$f":"IF(D15=Einstellungen!$D$6,'Daten VE'!K15,IF(D15>Einstellungen!$D$6,'Daten VE'!L14+L14*E15-IF(Anlageziele!$E$12='Daten Einstellg_Ziele'!$C$19,Anlageziele!$E$13,Vermerh.!$B$6/Anlageziele!$E$13),0))","v":{"v":5500000,"d":"5,500,000"}},null,{"$f":"IF(Tabelle1[[#This Row],[Währung]]=\"EUR\",Tabelle1[[#This Row],[Betrag]],Tabelle1[[#This Row],[Betrag]]/1.95583)","v":0},null,null,"Okt",2.5]
[null,null,{"$f":"IF(C15=\"\",\"\",IF(C15=Einstellungen!$D$7-1,\"\",'Daten VE'!C15+1))","v":2010},2002,{"v":0.014,"d":"1.4%"},{"$f":"IF($D16=Vermerh.!$D$6,$N$6,0)","v":0},{"$f":"IF(D16=Vermerh.!$D$11,$N$11,0)+IF(D16=Vermerh.!$D$12,$N$12,0)+IF(D16=Vermerh.!$D$13,$N$13,0)+IF(D16=Vermerh.!$D$14,$N$14,0)+IF(D16=Vermerh.!$D$15,$N$15,0)","v":0},{"$f":"IF(D16=Vermerh.!$D$20,$N$19,0)+IF(D16=Vermerh.!$D$21,$N$20,0)+IF(D16=Vermerh.!$D$22,$N$21,0)+IF(D16=Vermerh.!$D$23,$N$22,0)+IF(D16=Vermerh.!$D$24,$N$23,0)","v":0},{"$f":"IF(D16=Vermerh.!$D$29,$N$28,0)+IF(D16=Vermerh.!$D$30,$N$29,0)+IF(D16=Vermerh.!$D$31,$N$30,0)+IF(D16=Vermerh.!$D$32,$N$31,0)+IF(D16=Vermerh.!$D$33,$N$32,0)","v":0},{"v":5500000,"d":"5,500,000"},{"v":5577000,"d":"5,577,000"},{"$f":"IF(D16=Einstellungen!$D$6,'Daten VE'!K16,IF(D16>Einstellungen!$D$6,'Daten VE'!L15+L15*E16-IF(Anlageziele!$E$12='Daten Einstellg_Ziele'!$C$19,Anlageziele!$E$13,Vermerh.!$B$6/Anlageziele!$E$13),0))","v":{"v":5302000,"d":"5,302,000"}},{"$nulls":4},"Nov",2.3]
[null,null,{"$f":"IF(C16=\"\",\"\",IF(C16=Einstellungen!$D$7-1,\"\",'Daten VE'!C16+1))","v":2011},2003,{"v":0.011,"d":"1.1%"},{"$f":"IF($D17=Vermerh.!$D$6,$N$6,0)","v":0},{"$f":"IF(D17=Vermerh.!$D$11,$N$11,0)+IF(D17=Vermerh.!$D$12,$N$12,0)+IF(D17=Vermerh.!$D$13,$N$13,0)+IF(D17=Vermerh.!$D$14,$N$14,0)+IF(D17=Vermerh.!$D$15,$N$15,0)","v":0},{"$f":"IF(D17=Vermerh.!$D$20,$N$19,0)+IF(D17=Vermerh.!$D$21,$N$20,0)+IF(D17=Vermerh.!$D$22,$N$21,0)+IF(D17=Vermerh.!$D$23,$N$22,0)+IF(D17=Vermerh.!$D$24,$N$23,0)","v":0},{"$f":"IF(D17=Vermerh.!$D$29,$N$28,0)+IF(D17=Vermerh.!$D$30,$N$29,0)+IF(D17=Vermerh.!$D$31,$N$30,0)+IF(D17=Vermerh.!$D$32,$N$31,0)+IF(D17=Vermerh.!$D$33,$N$32,0)","v":0},{"v":5500000,"d":"5,500,000"},{"v":5638347,"d":"5,638,347"},{"$f":"IF(D17=Einstellungen!$D$6,'Daten VE'!K17,IF(D17>Einstellungen!$D$6,'Daten VE'!L16+L16*E17-IF(Anlageziele!$E$12='Daten Einstellg_Ziele'!$C$19,Anlageziele!$E$13,Vermerh.!$B$6/Anlageziele!$E$13),0))","v":{"v":5085322,"d":"5,085,322"}},{"$nulls":4},"Dez",1.7]
[null,null,{"$f":"IF(C17=\"\",\"\",IF(C17=Einstellungen!$D$7-1,\"\",'Daten VE'!C17+1))","v":2012},2004,{"v":0.016,"d":"1.6%"},{"$f":"IF($D18=Vermerh.!$D$6,$N$6,0)","v":0},{"$f":"IF(D18=Vermerh.!$D$11,$N$11,0)+IF(D18=Vermerh.!$D$12,$N$12,0)+IF(D18=Vermerh.!$D$13,$N$13,0)+IF(D18=Vermerh.!$D$14,$N$14,0)+IF(D18=Vermerh.!$D$15,$N$15,0)","v":0},{"$f":"IF(D18=Vermerh.!$D$20,$N$19,0)+IF(D18=Vermerh.!$D$21,$N$20,0)+IF(D18=Vermerh.!$D$22,$N$21,0)+IF(D18=Vermerh.!$D$23,$N$22,0)+IF(D18=Vermerh.!$D$24,$N$23,0)","v":0},{"$f":"IF(D18=Vermerh.!$D$29,$N$28,0)+IF(D18=Vermerh.!$D$30,$N$29,0)+IF(D18=Vermerh.!$D$31,$N$30,0)+IF(D18=Vermerh.!$D$32,$N$31,0)+IF(D18=Vermerh.!$D$33,$N$32,0)","v":0},{"v":5500000,"d":"5,500,000"},{"v":5728560.552,"d":"5,728,561"},{"$f":"IF(D18=Einstellungen!$D$6,'Daten VE'!K18,IF(D18>Einstellungen!$D$6,'Daten VE'!L17+L17*E18-IF(Anlageziele!$E$12='Daten Einstellg_Ziele'!$C$19,Anlageziele!$E$13,Vermerh.!$B$6/Anlageziele!$E$13),0))","v":{"v":4891687.152,"d":"4,891,687"}},{"$nulls":4},"Schnitt",{"$f":"SUM(R6:R17)/COUNTIF(R6:R17,\"<>0\")","v":{"v":1.9416666666666664,"d":"1.9"}}]
[null,null,{"$f":"IF(C18=\"\",\"\",IF(C18=Einstellungen!$D$7-1,\"\",'Daten VE'!C18+1))","v":2013},2005,{"v":0.016,"d":"1.6%"},{"$f":"IF($D19=Vermerh.!$D$6,$N$6,0)","v":0},{"$f":"IF(D19=Vermerh.!$D$11,$N$11,0)+IF(D19=Vermerh.!$D$12,$N$12,0)+IF(D19=Vermerh.!$D$13,$N$13,0)+IF(D19=Vermerh.!$D$14,$N$14,0)+IF(D19=Vermerh.!$D$15,$N$15,0)","v":0},{"$f":"IF(D19=Vermerh.!$D$20,$N$19,0)+IF(D19=Vermerh.!$D$21,$N$20,0)+IF(D19=Vermerh.!$D$22,$N$21,0)+IF(D19=Vermerh.!$D$23,$N$22,0)+IF(D19=Vermerh.!$D$24,$N$23,0)","v":0},{"$f":"IF(D19=Vermerh.!$D$29,$N$28,0)+IF(D19=Vermerh.!$D$30,$N$29,0)+IF(D19=Vermerh.!$D$31,$N$30,0)+IF(D19=Vermerh.!$D$32,$N$31,0)+IF(D19=Vermerh.!$D$33,$N$32,0)","v":0},{"v":5500000,"d":"5,500,000"},{"v":5820217.520832,"d":"5,820,218"},{"$f":"IF(D19=Einstellungen!$D$6,'Daten VE'!K19,IF(D19>Einstellungen!$D$6,'Daten VE'!L18+L18*E19-IF(Anlageziele!$E$12='Daten Einstellg_Ziele'!$C$19,Anlageziele!$E$13,Vermerh.!$B$6/Anlageziele!$E$13),0))","v":{"v":4694954.146432,"d":"4,694,954"}},"Zuschreibungen:",{"$f":"IF(Vermerh.!C20=\"EUR\",Vermerh.!B20,Vermerh.!B20/1.95583)","v":0}]
[null,null,{"$f":"IF(C19=\"\",\"\",IF(C19=Einstellungen!$D$7-1,\"\",'Daten VE'!C19+1))","v":2014},2006,{"v":0.015,"d":"1.5%"},{"$f":"IF($D20=Vermerh.!$D$6,$N$6,0)","v":0},{"$f":"IF(D20=Vermerh.!$D$11,$N$11,0)+IF(D20=Vermerh.!$D$12,$N$12,0)+IF(D20=Vermerh.!$D$13,$N$13,0)+IF(D20=Vermerh.!$D$14,$N$14,0)+IF(D20=Vermerh.!$D$15,$N$15,0)","v":0},{"$f":"IF(D20=Vermerh.!$D$20,$N$19,0)+IF(D20=Vermerh.!$D$21,$N$20,0)+IF(D20=Vermerh.!$D$22,$N$21,0)+IF(D20=Vermerh.!$D$23,$N$22,0)+IF(D20=Vermerh.!$D$24,$N$23,0)","v":0},{"$f":"IF(D20=Vermerh.!$D$29,$N$28,0)+IF(D20=Vermerh.!$D$30,$N$29,0)+IF(D20=Vermerh.!$D$31,$N$30,0)+IF(D20=Vermerh.!$D$32,$N$31,0)+IF(D20=Vermerh.!$D$33,$N$32,0)","v":0},{"v":5500000,"d":"5,500,000"},{"v":5907520.783644481,"d":"5,907,521"},{"$f":"IF(D20=Einstellungen!$D$6,'Daten VE'!K20,IF(D20>Einstellungen!$D$6,'Daten VE'!L19+L19*E20-IF(Anlageziele!$E$12='Daten Einstellg_Ziele'!$C$19,Anlageziele!$E$13,Vermerh.!$B$6/Anlageziele!$E$13),0))","v":{"v":4490378.45862848,"d":"4,490,378"}},null,{"$f":"IF(Vermerh.!C21=\"EUR\",Vermerh.!B21,Vermerh.!B21/1.95583)","v":0}]
[null,null,{"$f":"IF(C20=\"\",\"\",IF(C20=Einstellungen!$D$7-1,\"\",'Daten VE'!C20+1))","v":2015},2007,{"v":0.023,"d":"2.3%"},{"$f":"IF($D21=Vermerh.!$D$6,$N$6,0)","v":0},{"$f":"IF(D21=Vermerh.!$D$11,$N$11,0)+IF(D21=Vermerh.!$D$12,$N$12,0)+IF(D21=Vermerh.!$D$13,$N$13,0)+IF(D21=Vermerh.!$D$14,$N$14,0)+IF(D21=Vermerh.!$D$15,$N$15,0)","v":0},{"$f":"IF(D21=Vermerh.!$D$20,$N$19,0)+IF(D21=Vermerh.!$D$21,$N$20,0)+IF(D21=Vermerh.!$D$22,$N$21,0)+IF(D21=Vermerh.!$D$23,$N$22,0)+IF(D21=Vermerh.!$D$24,$N$23,0)","v":0},{"$f":"IF(D21=Vermerh.!$D$29,$N$28,0)+IF(D21=Vermerh.!$D$30,$N$29,0)+IF(D21=Vermerh.!$D$31,$N$30,0)+IF(D21=Vermerh.!$D$32,$N$31,0)+IF(D21=Vermerh.!$D$33,$N$32,0)","v":0},{"v":5500000,"d":"5,500,000"},{"v":6043393.761668304,"d":"6,043,394"},{"$f":"IF(D21=Einstellungen!$D$6,'Daten VE'!K21,IF(D21>Einstellungen!$D$6,'Daten VE'!L20+L20*E21-IF(Anlageziele!$E$12='Daten Einstellg_Ziele'!$C$19,Anlageziele!$E$13,Vermerh.!$B$6/Anlageziele!$E$13),0))","v":{"v":4318657.163176935,"d":"4,318,657"}},null,{"$f":"IF(Vermerh.!C22=\"EUR\",Vermerh.!B22,Vermerh.!B22/1.95583)","v":0}]
[null,null,{"$f":"IF(C21=\"\",\"\",IF(C21=Einstellungen!$D$7-1,\"\",'Daten VE'!C21+1))","v":2016},2008,{"v":0.026,"d":"2.6%"},{"$f":"IF($D22=Vermerh.!$D$6,$N$6,0)","v":0},{"$f":"IF(D22=Vermerh.!$D$11,$N$11,0)+IF(D22=Vermerh.!$D$12,$N$12,0)+IF(D22=Vermerh.!$D$13,$N$13,0)+IF(D22=Vermerh.!$D$14,$N$14,0)+IF(D22=Vermerh.!$D$15,$N$15,0)","v":0},{"$f":"IF(D22=Vermerh.!$D$20,$N$19,0)+IF(D22=Vermerh.!$D$21,$N$20,0)+IF(D22=Vermerh.!$D$22,$N$21,0)+IF(D22=Vermerh.!$D$23,$N$22,0)+IF(D22=Vermerh.!$D$24,$N$23,0)","v":0},{"$f":"IF(D22=Vermerh.!$D$29,$N$28,0)+IF(D22=Vermerh.!$D$30,$N$29,0)+IF(D22=Vermerh.!$D$31,$N$30,0)+IF(D22=Vermerh.!$D$32,$N$31,0)+IF(D22=Vermerh.!$D$33,$N$32,0)","v":0},{"v":5500000,"d":"5,500,000"},{"v":6200521.99947168,"d":"6,200,522"},{"$f":"IF(D22=Einstellungen!$D$6,'Daten VE'!K22,IF(D22>Einstellungen!$D$6,'Daten VE'!L21+L21*E22-IF(Anlageziele!$E$12='Daten Einstellg_Ziele'!$C$19,Anlageziele!$E$13,Vermerh.!$B$6/Anlageziele!$E$13),0))","v":{"v":4155942.2494195355,"d":"4,155,942"}},null,{"$f":"IF(Vermerh.!C23=\"EUR\",Vermerh.!B23,Vermerh.!B23/1.95583)","v":0}]
[null,null,{"$f":"IF(C22=\"\",\"\",IF(C22=Einstellungen!$D$7-1,\"\",'Daten VE'!C22+1))","v":2017},2009,{"v":0.003,"d":"0.3%"},{"$f":"IF($D23=Vermerh.!$D$6,$N$6,0)","v":0},{"$f":"IF(D23=Vermerh.!$D$11,$N$11,0)+IF(D23=Vermerh.!$D$12,$N$12,0)+IF(D23=Vermerh.!$D$13,$N$13,0)+IF(D23=Vermerh.!$D$14,$N$14,0)+IF(D23=Vermerh.!$D$15,$N$15,0)","v":{"v":500000,"d":"500,000"}},{"$f":"IF(D23=Vermerh.!$D$20,$N$19,0)+IF(D23=Vermerh.!$D$21,$N$20,0)+IF(D23=Vermerh.!$D$22,$N$21,0)+IF(D23=Vermerh.!$D$23,$N$22,0)+IF(D23=Vermerh.!$D$24,$N$23,0)","v":0},{"$f":"IF(D23=Vermerh.!$D$29,$N$28,0)+IF(D23=Vermerh.!$D$30,$N$29,0)+IF(D23=Vermerh.!$D$31,$N$30,0)+IF(D23=Vermerh.!$D$32,$N$31,0)+IF(D23=Vermerh.!$D$33,$N$32,0)","v":0},{"v":6000000,"d":"6,000,000"},{"v":6719123.565470096,"d":"6,719,124"},{"$f":"IF(D23=Einstellungen!$D$6,'Daten VE'!K23,IF(D23>Einstellungen!$D$6,'Daten VE'!L22+L22*E23-IF(Anlageziele!$E$12='Daten Einstellg_Ziele'!$C$19,Anlageziele!$E$13,Vermerh.!$B$6/Anlageziele!$E$13),0))","v":{"v":3893410.076167794,"d":"3,893,410"}},null,{"$f":"IF(Vermerh.!C24=\"EUR\",Vermerh.!B24,Vermerh.!B24/1.95583)","v":0}]
[null,null,{"$f":"IF(C23=\"\",\"\",IF(C23=Einstellungen!$D$7-1,\"\",'Daten VE'!C23+1))","v":2018},2010,{"v":0.011,"d":"1.1%"},{"$f":"IF($D24=Vermerh.!$D$6,$N$6,0)","v":0},{"$f":"IF(D24=Vermerh.!$D$11,$N$11,0)+IF(D24=Vermerh.!$D$12,$N$12,0)+IF(D24=Vermerh.!$D$13,$N$13,0)+IF(D24=Vermerh.!$D$14,$N$14,0)+IF(D24=Vermerh.!$D$15,$N$15,0)","v":0},{"$f":"IF(D24=Vermerh.!$D$20,$N$19,0)+IF(D24=Vermerh.!$D$21,$N$20,0)+IF(D24=Vermerh.!$D$22,$N$21,0)+IF(D24=Vermerh.!$D$23,$N$22,0)+IF(D24=Vermerh.!$D$24,$N$23,0)","v":0},{"$f":"IF(D24=Vermerh.!$D$29,$N$28,0)+IF(D24=Vermerh.!$D$30,$N$29,0)+IF(D24=Vermerh.!$D$31,$N$30,0)+IF(D24=Vermerh.!$D$32,$N$31,0)+IF(D24=Vermerh.!$D$33,$N$32,0)","v":0},{"v":6000000,"d":"6,000,000"},{"v":6793033.924690267,"d":"6,793,034"},{"$f":"IF(D24=Einstellungen!$D$6,'Daten VE'!K24,IF(D24>Einstellungen!$D$6,'Daten VE'!L23+L23*E24-IF(Anlageziele!$E$12='Daten Einstellg_Ziele'!$C$19,Anlageziele!$E$13,Vermerh.!$B$6/Anlageziele!$E$13),0))","v":{"v":3661237.5870056394,"d":"3,661,238"}}]
[null,null,{"$f":"IF(C24=\"\",\"\",IF(C24=Einstellungen!$D$7-1,\"\",'Daten VE'!C24+1))","v":""},2011,{"v":0.021,"d":"2.1%"},{"$f":"IF($D25=Vermerh.!$D$6,$N$6,0)","v":0},{"$f":"IF(D25=Vermerh.!$D$11,$N$11,0)+IF(D25=Vermerh.!$D$12,$N$12,0)+IF(D25=Vermerh.!$D$13,$N$13,0)+IF(D25=Vermerh.!$D$14,$N$14,0)+IF(D25=Vermerh.!$D$15,$N$15,0)","v":0},{"$f":"IF(D25=Vermerh.!$D$20,$N$19,0)+IF(D25=Vermerh.!$D$21,$N$20,0)+IF(D25=Vermerh.!$D$22,$N$21,0)+IF(D25=Vermerh.!$D$23,$N$22,0)+IF(D25=Vermerh.!$D$24,$N$23,0)","v":0},{"$f":"IF(D25=Vermerh.!$D$29,$N$28,0)+IF(D25=Vermerh.!$D$30,$N$29,0)+IF(D25=Vermerh.!$D$31,$N$30,0)+IF(D25=Vermerh.!$D$32,$N$31,0)+IF(D25=Vermerh.!$D$33,$N$32,0)","v":0},{"v":6000000,"d":"6,000,000"},{"v":6935687.637108763,"d":"6,935,688"},{"$f":"IF(D25=Einstellungen!$D$6,'Daten VE'!K25,IF(D25>Einstellungen!$D$6,'Daten VE'!L24+L24*E25-IF(Anlageziele!$E$12='Daten Einstellg_Ziele'!$C$19,Anlageziele!$E$13,Vermerh.!$B$6/Anlageziele!$E$13),0))","v":{"v":3463123.5763327577,"d":"3,463,124"}}]
[null,null,{"$f":"IF(C25=\"\",\"\",IF(C25=Einstellungen!$D$7-1,\"\",'Daten VE'!C25+1))","v":""},2012,{"v":0.02,"d":"2.0%"},{"$f":"IF($D26=Vermerh.!$D$6,$N$6,0)","v":0},{"$f":"IF(D26=Vermerh.!$D$11,$N$11,0)+IF(D26=Vermerh.!$D$12,$N$12,0)+IF(D26=Vermerh.!$D$13,$N$13,0)+IF(D26=Vermerh.!$D$14,$N$14,0)+IF(D26=Vermerh.!$D$15,$N$15,0)","v":0},{"$f":"IF(D26=Vermerh.!$D$20,$N$19,0)+IF(D26=Vermerh.!$D$21,$N$20,0)+IF(D26=Vermerh.!$D$22,$N$21,0)+IF(D26=Vermerh.!$D$23,$N$22,0)+IF(D26=Vermerh.!$D$24,$N$23,0)","v":0},{"$f":"IF(D26=Vermerh.!$D$29,$N$28,0)+IF(D26=Vermerh.!$D$30,$N$29,0)+IF(D26=Vermerh.!$D$31,$N$30,0)+IF(D26=Vermerh.!$D$32,$N$31,0)+IF(D26=Vermerh.!$D$33,$N$32,0)","v":0},{"v":6000000,"d":"6,000,000"},{"v":7074401.389850938,"d":"7,074,401"},{"$f":"IF(D26=Einstellungen!$D$6,'Daten VE'!K26,IF(D26>Einstellungen!$D$6,'Daten VE'!L25+L25*E26-IF(Anlageziele!$E$12='Daten Einstellg_Ziele'!$C$19,Anlageziele!$E$13,Vermerh.!$B$6/Anlageziele!$E$13),0))","v":{"v":3257386.047859413,"d":"3,257,386"}}]
[null,null,{"$f":"IF(C26=\"\",\"\",IF(C26=Einstellungen!$D$7-1,\"\",'Daten VE'!C26+1))","v":""},2013,{"v":0.015,"d":"1.5%"},{"$f":"IF($D27=Vermerh.!$D$6,$N$6,0)","v":0},{"$f":"IF(D27=Vermerh.!$D$11,$N$11,0)+IF(D27=Vermerh.!$D$12,$N$12,0)+IF(D27=Vermerh.!$D$13,$N$13,0)+IF(D27=Vermerh.!$D$14,$N$14,0)+IF(D27=Vermerh.!$D$15,$N$15,0)","v":0},{"$f":"IF(D27=Vermerh.!$D$20,$N$19,0)+IF(D27=Vermerh.!$D$21,$N$20,0)+IF(D27=Vermerh.!$D$22,$N$21,0)+IF(D27=Vermerh.!$D$23,$N$22,0)+IF(D27=Vermerh.!$D$24,$N$23,0)","v":0},{"$f":"IF(D27=Vermerh.!$D$29,$N$28,0)+IF(D27=Vermerh.!$D$30,$N$29,0)+IF(D27=Vermerh.!$D$31,$N$30,0)+IF(D27=Vermerh.!$D$32,$N$31,0)+IF(D27=Vermerh.!$D$33,$N$32,0)","v":0},{"v":6000000,"d":"6,000,000"},{"v":7180517.410698702,"d":"7,180,517"},{"$f":"IF(D27=Einstellungen!$D$6,'Daten VE'!K27,IF(D27>Einstellungen!$D$6,'Daten VE'!L26+L26*E27-IF(Anlageziele!$E$12='Daten Einstellg_Ziele'!$C$19,Anlageziele!$E$13,Vermerh.!$B$6/Anlageziele!$E$13),0))","v":{"v":3031246.8385773045,"d":"3,031,247"}}]
[null,null,{"$f":"IF(C27=\"\",\"\",IF(C27=Einstellungen!$D$7-1,\"\",'Daten VE'!C27+1))","v":""},2014,{"v":0.009,"d":"0.9%"},{"$f":"IF($D28=Vermerh.!$D$6,$N$6,0)","v":0},{"$f":"IF(D28=Vermerh.!$D$11,$N$11,0)+IF(D28=Vermerh.!$D$12,$N$12,0)+IF(D28=Vermerh.!$D$13,$N$13,0)+IF(D28=Vermerh.!$D$14,$N$14,0)+IF(D28=Vermerh.!$D$15,$N$15,0)","v":0},{"$f":"IF(D28=Vermerh.!$D$20,$N$19,0)+IF(D28=Vermerh.!$D$21,$N$20,0)+IF(D28=Vermerh.!$D$22,$N$21,0)+IF(D28=Vermerh.!$D$23,$N$22,0)+IF(D28=Vermerh.!$D$24,$N$23,0)","v":0},{"$f":"IF(D28=Vermerh.!$D$29,$N$28,0)+IF(D28=Vermerh.!$D$30,$N$29,0)+IF(D28=Vermerh.!$D$31,$N$30,0)+IF(D28=Vermerh.!$D$32,$N$31,0)+IF(D28=Vermerh.!$D$33,$N$32,0)","v":0},{"v":6000000,"d":"6,000,000"},{"v":7245142.06739499,"d":"7,245,142"},{"$f":"IF(D28=Einstellungen!$D$6,'Daten VE'!K28,IF(D28>Einstellungen!$D$6,'Daten VE'!L27+L27*E28-IF(Anlageziele!$E$12='Daten Einstellg_Ziele'!$C$19,Anlageziele!$E$13,Vermerh.!$B$6/Anlageziele!$E$13),0))","v":{"v":2783528.0601245,"d":"2,783,528"}},"Abschreibungen:",{"$f":"IF(Vermerh.!C29=\"EUR\",Vermerh.!B29,Vermerh.!B29/1.95583)*-1","v":0}]
[null,null,{"$f":"IF(C28=\"\",\"\",IF(C28=Einstellungen!$D$7-1,\"\",'Daten VE'!C28+1))","v":""},2015,{"v":0.003,"d":"0.3%"},{"$f":"IF($D29=Vermerh.!$D$6,$N$6,0)","v":0},{"$f":"IF(D29=Vermerh.!$D$11,$N$11,0)+IF(D29=Vermerh.!$D$12,$N$12,0)+IF(D29=Vermerh.!$D$13,$N$13,0)+IF(D29=Vermerh.!$D$14,$N$14,0)+IF(D29=Vermerh.!$D$15,$N$15,0)","v":0},{"$f":"IF(D29=Vermerh.!$D$20,$N$19,0)+IF(D29=Vermerh.!$D$21,$N$20,0)+IF(D29=Vermerh.!$D$22,$N$21,0)+IF(D29=Vermerh.!$D$23,$N$22,0)+IF(D29=Vermerh.!$D$24,$N$23,0)","v":0},{"$f":"IF(D29=Vermerh.!$D$29,$N$28,0)+IF(D29=Vermerh.!$D$30,$N$29,0)+IF(D29=Vermerh.!$D$31,$N$30,0)+IF(D29=Vermerh.!$D$32,$N$31,0)+IF(D29=Vermerh.!$D$33,$N$32,0)","v":0},{"v":6000000,"d":"6,000,000"},{"v":7266877.493597174,"d":"7,266,877"},{"$f":"IF(D29=Einstellungen!$D$6,'Daten VE'!K29,IF(D29>Einstellungen!$D$6,'Daten VE'!L28+L28*E29-IF(Anlageziele!$E$12='Daten Einstellg_Ziele'!$C$19,Anlageziele!$E$13,Vermerh.!$B$6/Anlageziele!$E$13),0))","v":{"v":2516878.644304874,"d":"2,516,879"}},null,{"$f":"IF(Vermerh.!C30=\"EUR\",Vermerh.!B30,Vermerh.!B30/1.95583)*-1","v":0}]
[null,null,{"$f":"IF(C29=\"\",\"\",IF(C29=Einstellungen!$D$7-1,\"\",'Daten VE'!C29+1))","v":""},2016,{"v":0.005,"d":"0.5%"},{"$f":"IF($D30=Vermerh.!$D$6,$N$6,0)","v":0},{"$f":"IF(D30=Vermerh.!$D$11,$N$11,0)+IF(D30=Vermerh.!$D$12,$N$12,0)+IF(D30=Vermerh.!$D$13,$N$13,0)+IF(D30=Vermerh.!$D$14,$N$14,0)+IF(D30=Vermerh.!$D$15,$N$15,0)","v":0},{"$f":"IF(D30=Vermerh.!$D$20,$N$19,0)+IF(D30=Vermerh.!$D$21,$N$20,0)+IF(D30=Vermerh.!$D$22,$N$21,0)+IF(D30=Vermerh.!$D$23,$N$22,0)+IF(D30=Vermerh.!$D$24,$N$23,0)","v":0},{"$f":"IF(D30=Vermerh.!$D$29,$N$28,0)+IF(D30=Vermerh.!$D$30,$N$29,0)+IF(D30=Vermerh.!$D$31,$N$30,0)+IF(D30=Vermerh.!$D$32,$N$31,0)+IF(D30=Vermerh.!$D$33,$N$32,0)","v":0},{"v":6000000,"d":"6,000,000"},{"v":7303211.88106516,"d":"7,303,212"},{"$f":"IF(D30=Einstellungen!$D$6,'Daten VE'!K30,IF(D30>Einstellungen!$D$6,'Daten VE'!L29+L29*E30-IF(Anlageziele!$E$12='Daten Einstellg_Ziele'!$C$19,Anlageziele!$E$13,Vermerh.!$B$6/Anlageziele!$E$13),0))","v":{"v":2254463.0375263984,"d":"2,254,463"}},null,{"$f":"IF(Vermerh.!C31=\"EUR\",Vermerh.!B31,Vermerh.!B31/1.95583)*-1","v":0}]
[null,null,{"$f":"IF(C30=\"\",\"\",IF(C30=Einstellungen!$D$7-1,\"\",'Daten VE'!C30+1))","v":""},2017,{"v":0.018,"d":"1.8%"},{"$f":"IF($D31=Vermerh.!$D$6,$N$6,0)","v":0},{"$f":"IF(D31=Vermerh.!$D$11,$N$11,0)+IF(D31=Vermerh.!$D$12,$N$12,0)+IF(D31=Vermerh.!$D$13,$N$13,0)+IF(D31=Vermerh.!$D$14,$N$14,0)+IF(D31=Vermerh.!$D$15,$N$15,0)","v":0},{"$f":"IF(D31=Vermerh.!$D$20,$N$19,0)+IF(D31=Vermerh.!$D$21,$N$20,0)+IF(D31=Vermerh.!$D$22,$N$21,0)+IF(D31=Vermerh.!$D$23,$N$22,0)+IF(D31=Vermerh.!$D$24,$N$23,0)","v":0},{"$f":"IF(D31=Vermerh.!$D$29,$N$28,0)+IF(D31=Vermerh.!$D$30,$N$29,0)+IF(D31=Vermerh.!$D$31,$N$30,0)+IF(D31=Vermerh.!$D$32,$N$31,0)+IF(D31=Vermerh.!$D$33,$N$32,0)","v":0},{"v":6000000,"d":"6,000,000"},{"v":7434669.694924333,"d":"7,434,670"},{"$f":"IF(D31=Einstellungen!$D$6,'Daten VE'!K31,IF(D31>Einstellungen!$D$6,'Daten VE'!L30+L30*E31-IF(Anlageziele!$E$12='Daten Einstellg_Ziele'!$C$19,Anlageziele!$E$13,Vermerh.!$B$6/Anlageziele!$E$13),0))","v":{"v":2020043.3722018735,"d":"2,020,043"}},null,{"$f":"IF(Vermerh.!C32=\"EUR\",Vermerh.!B32,Vermerh.!B32/1.95583)*-1","v":0}]
[null,null,{"$f":"IF(C31=\"\",\"\",IF(C31=Einstellungen!$D$7-1,\"\",'Daten VE'!C31+1))","v":""},2018,{"v":0.019,"d":"1.9%"},{"$f":"IF($D32=Vermerh.!$D$6,$N$6,0)","v":0},{"$f":"IF(D32=Vermerh.!$D$11,$N$11,0)+IF(D32=Vermerh.!$D$12,$N$12,0)+IF(D32=Vermerh.!$D$13,$N$13,0)+IF(D32=Vermerh.!$D$14,$N$14,0)+IF(D32=Vermerh.!$D$15,$N$15,0)","v":0},{"$f":"IF(D32=Vermerh.!$D$20,$N$19,0)+IF(D32=Vermerh.!$D$21,$N$20,0)+IF(D32=Vermerh.!$D$22,$N$21,0)+IF(D32=Vermerh.!$D$23,$N$22,0)+IF(D32=Vermerh.!$D$24,$N$23,0)","v":0},{"$f":"IF(D32=Vermerh.!$D$29,$N$28,0)+IF(D32=Vermerh.!$D$30,$N$29,0)+IF(D32=Vermerh.!$D$31,$N$30,0)+IF(D32=Vermerh.!$D$32,$N$31,0)+IF(D32=Vermerh.!$D$33,$N$32,0)","v":0},{"$f":"J31+SUM(F32:I32)","v":{"v":6000000,"d":"6,000,000"}},{"$f":"K31+K31*E32+SUM(F32:I32)","v":{"v":7575928.4191278955,"d":"7,575,928"}},{"$f":"IF(D32=Einstellungen!$D$6,'Daten VE'!K32,IF(D32>Einstellungen!$D$6,'Daten VE'!L31+L31*E32-IF(Anlageziele!$E$12='Daten Einstellg_Ziele'!$C$19,Anlageziele!$E$13,Vermerh.!$B$6/Anlageziele!$E$13),0))","v":{"v":1783424.196273709,"d":"1,783,424"}},null,{"$f":"IF(Vermerh.!C33=\"EUR\",Vermerh.!B33,Vermerh.!B33/1.95583)*-1","v":0}]
[null,null,{"$f":"IF(C32=\"\",\"\",IF(C32=Einstellungen!$D$7-1,\"\",'Daten VE'!C32+1))","v":""}]
[null,null,{"$f":"IF(C33=\"\",\"\",IF(C33=Einstellungen!$D$7-1,\"\",'Daten VE'!C33+1))","v":""}]
[]
[]
[null,null,"Soll",{"$f":"E37-1","v":2014},2015,2016,2017,{"$f":"I37-1","v":2018},{"$f":"Einstellungen!D7","v":2019},{"$f":"I37+1","v":2020},{"$f":"J37+1","v":2021},2022,2023]
[null,null,"Real",{"$f":"SUMIF($D$6:$D$34,D37,$K$6:$K$34)","v":{"v":7245142.06739499,"d":"7,245,142"}},{"$f":"SUMIF($D$6:$D$34,E37,$K$6:$K$31)","v":{"v":7266877.493597174,"d":"7,266,877"}},{"$f":"SUMIF($D$6:$D$34,F37,$K$6:$K$31)","v":{"v":7303211.88106516,"d":"7,303,212"}},{"$f":"SUMIF($D$6:$D$34,G37,$K$6:$K$31)","v":{"v":7434669.694924333,"d":"7,434,670"}},{"$f":"SUMIF($D$6:$D$34,H37,$K$6:$K$31)","v":{"v":7575928.4191278955,"d":"7,575,928"}},{"$f":"D54+D54*Einstellungen!K24","v":{"v":7727446.987510453,"d":"7,727,447"}},{"$f":"I38+I38*Einstellungen!K25","v":{"v":7881995.927260662,"d":"7,881,996"}},{"$f":"J38+J38*Einstellungen!K26","v":{"v":8039635.845805876,"d":"8,039,636"}},{"$f":"K38+K38*Einstellungen!K27","v":{"v":8200428.562721994,"d":"8,200,429"}},{"$f":"L38+L38*Einstellungen!K28","v":{"v":8364437.133976433,"d":"8,364,437"}}]
[null,null,"Nominal",{"$f":"SUMIF($D$6:$D$34,D37,$J$6:$J$34)","v":{"v":6000000,"d":"6,000,000"}},{"$f":"SUMIF($D$6:$D$34,E37,$J$6:$J$34)","v":{"v":6000000,"d":"6,000,000"}},{"$f":"SUMIF($D$6:$D$34,F37,$J$6:$J$34)","v":{"v":6000000,"d":"6,000,000"}},{"$f":"SUMIF($D$6:$D$34,G37,$J$6:$J$34)","v":{"v":6000000,"d":"6,000,000"}},{"$f":"SUMIF($D$6:$D$34,H37,$J$6:$J$34)","v":{"v":6000000,"d":"6,000,000"}},{"$f":"H39+'Einn._Ausg.'!C8","v":{"v":6000000,"d":"6,000,000"}},{"$f":"I39+'Einn._Ausg.'!D8","v":{"v":6000000,"d":"6,000,000"}},{"$f":"J39+'Einn._Ausg.'!E8","v":{"v":6000000,"d":"6,000,000"}},{"$f":"K39+'Einn._Ausg.'!F8","v":{"v":6000000,"d":"6,000,000"}},{"$f":"L39+'Einn._Ausg.'!G8","v":{"v":6000000,"d":"6,000,000"}}]
[null,null,"Verbrauch",{"$f":"SUMIF($D$6:$D$34,D37,$L$6:$L$34)","v":{"v":2783528.0601245,"d":"2,783,528"}},{"$f":"SUMIF($D$6:$D$34,E37,$L$6:$L$34)","v":{"v":2516878.644304874,"d":"2,516,879"}},{"$f":"SUMIF($D$6:$D$34,F37,$L$6:$L$34)","v":{"v":2254463.0375263984,"d":"2,254,463"}},{"$f":"SUMIF($D$6:$D$34,G37,$L$6:$L$34)","v":{"v":2020043.3722018735,"d":"2,020,043"}},{"$f":"SUMIF($D$6:$D$34,H37,$L$6:$L$34)","v":{"v":1783424.196273709,"d":"1,783,424"}},{"$f":"D55-IF(Anlageziele!$E$12='Daten Einstellg_Ziele'!$C$19,Anlageziele!$E$13,Vermerh.!$B$6/Anlageziele!$E$13)","v":{"v":1508424.196273709,"d":"1,508,424"}},{"$f":"I40-IF(Anlageziele!$E$12='Daten Einstellg_Ziele'!$C$19,Anlageziele!$E$13,Vermerh.!$B$6/Anlageziele!$E$13)","v":{"v":1233424.196273709,"d":"1,233,424"}},{"$f":"J40-IF(Anlageziele!$E$12='Daten Einstellg_Ziele'!$C$19,Anlageziele!$E$13,Vermerh.!$B$6/Anlageziele!$E$13)","v":{"v":958424.196273709,"d":"958,424"}},{"$f":"K40-IF(Anlageziele!$E$12='Daten Einstellg_Ziele'!$C$19,Anlageziele!$E$13,Vermerh.!$B$6/Anlageziele!$E$13)","v":{"v":683424.196273709,"d":"683,424"}},{"$f":"L40-IF(Anlageziele!$E$12='Daten Einstellg_Ziele'!$C$19,Anlageziele!$E$13,Vermerh.!$B$6/Anlageziele!$E$13)","v":{"v":408424.19627370895,"d":"408,424"}}]
[null,null,"Substanz",{"$f":"E41","v":{"v":7600000,"d":"7,600,000"}},{"v":7600000,"d":"7,600,000"},{"v":7600000,"d":"7,600,000"},{"$f":"H41","v":{"v":7600000,"d":"7,600,000"}},{"$f":"'Zahlen Basis'!E6","v":{"v":7600000,"d":"7,600,000"}},{"$f":"'Zahlen Basis'!F6","v":{"v":7651750,"d":"7,651,750"}},{"$f":"'Zahlen Basis'!G6","v":{"v":7704271.25,"d":"7,704,271"}},{"$f":"'Zahlen Basis'!H6","v":{"v":7757582.48125,"d":"7,757,582"}},{"$f":"'Zahlen Basis'!I6","v":{"v":7811702.95990625,"d":"7,811,703"}},{"$f":"'Zahlen Basis'!J6","v":{"v":7866652.502893283,"d":"7,866,653"}}]
[]
[null,null,"Grafik Vermögenserhaltung"]
[{"$nulls":3},{"$f":"D37","v":2014},{"$f":"E37","v":2015},2016,2017,2018,2019,2020,2021,2022,{"$f":"M37","v":2023}]
[null,null,"Vermögenserhaltungsziel",{"$f":"IF(Anlageziele!$E$5=\"Substanz\",'Daten VE'!D41,IF(Anlageziele!$E$5=\"Nominal\",D39,IF(Anlageziele!$E$5=\"Verbrauch\",D40,D38)))","v":{"v":7245142.06739499,"d":"7,245,142"}},{"$f":"IF(Anlageziele!$E$5=\"Substanz\",'Daten VE'!E41,IF(Anlageziele!$E$5=\"Nominal\",E39,IF(Anlageziele!$E$5=\"Verbrauch\",E40,E38)))","v":{"v":7266877.493597174,"d":"7,266,877"}},{"$f":"IF(Anlageziele!$E$5=\"Substanz\",'Daten VE'!F41,IF(Anlageziele!$E$5=\"Nominal\",F39,IF(Anlageziele!$E$5=\"Verbrauch\",F40,F38)))","v":{"v":7303211.88106516,"d":"7,303,212"}},{"$f":"IF(Anlageziele!$E$5=\"Substanz\",'Daten VE'!G41,IF(Anlageziele!$E$5=\"Nominal\",G39,IF(Anlageziele!$E$5=\"Verbrauch\",G40,G38)))","v":{"v":7434669.694924333,"d":"7,434,670"}},{"$f":"IF(Anlageziele!$E$5=\"Substanz\",'Daten VE'!H41,IF(Anlageziele!$E$5=\"Nominal\",H39,IF(Anlageziele!$E$5=\"Verbrauch\",H40,H38)))","v":{"v":7575928.4191278955,"d":"7,575,928"}},{"$f":"IF(Anlageziele!$E$5=\"Substanz\",'Daten VE'!I41,IF(Anlageziele!$E$5=\"Nominal\",I39,IF(Anlageziele!$E$5=\"Verbrauch\",I40,I38)))","v":{"v":7727446.987510453,"d":"7,727,447"}},{"$f":"IF(Anlageziele!$E$5=\"Substanz\",'Daten VE'!J41,IF(Anlageziele!$E$5=\"Nominal\",J39,IF(Anlageziele!$E$5=\"Verbrauch\",J40,J38)))","v":{"v":7881995.927260662,"d":"7,881,996"}},{"$f":"IF(Anlageziele!$E$5=\"Substanz\",'Daten VE'!K41,IF(Anlageziele!$E$5=\"Nominal\",K39,IF(Anlageziele!$E$5=\"Verbrauch\",K40,K38)))","v":{"v":8039635.845805876,"d":"8,039,636"}},{"$f":"IF(Anlageziele!$E$5=\"Substanz\",'Daten VE'!L41,IF(Anlageziele!$E$5=\"Nominal\",L39,IF(Anlageziele!$E$5=\"Verbrauch\",L40,L38)))","v":{"v":8200428.562721994,"d":"8,200,429"}},{"$f":"IF(Anlageziele!$E$5=\"Substanz\",'Daten VE'!M41,IF(Anlageziele!$E$5=\"Nominal\",M39,IF(Anlageziele!$E$5=\"Verbrauch\",M40,M38)))","v":{"v":8364437.133976433,"d":"8,364,437"}}]
[null,null,"Projektion",{"$nulls":4},{"$f":"'Zahlen Basis'!E6","v":{"v":7600000,"d":"7,600,000"}},{"$f":"'Zahlen Basis'!F6","v":{"v":7651750,"d":"7,651,750"}},{"$f":"'Zahlen Basis'!G6","v":{"v":7704271.25,"d":"7,704,271"}},{"$f":"'Zahlen Basis'!H6","v":{"v":7757582.48125,"d":"7,757,582"}},{"$f":"'Zahlen Basis'!I6","v":{"v":7811702.95990625,"d":"7,811,703"}},{"$f":"'Zahlen Basis'!J6","v":{"v":7866652.502893283,"d":"7,866,653"}}]
[null,null,"Zielerreichung",{"$nulls":4},{"$f":"(H46-H45)/H45","v":{"v":3.1773770210563193E-3,"d":"0.3%"}}]
[]
[null,null,"Ausgangswert Vermögenserhaltung"]
[{"$nulls":3},"Grundstock","Investitionsvermögen"]
[null,null,"Grundstock nominal ",{"$f":"N5","v":{"v":6000000,"d":"6,000,000"}}]
[null,null,"Inflationsausgleich",{"$f":"IF(Anlageziele!E5=\"Real\",D54-D51,0)","v":{"v":1575928.4191278955,"d":"1,575,928"}}]
[null,null,"Investitionsvermögen",null,{"$f":"Vermentw.!K14","v":{"v":7600000,"d":"7,600,000"}}]
[null,null,"Grundstock real (Soll)",{"$f":"SUMIF($D$6:$D$34,Einstellungen!$D$7-1,'Daten VE'!$K$6:$K$34)","v":{"v":7575928.4191278955,"d":"7,575,928"}}]
[null,null,"Grundstock Verbrauch",{"$f":"SUMIF($D$6:$D$34,Einstellungen!$D$7-1,'Daten VE'!$L$6:$L$34)","v":{"v":1783424.196273709,"d":"1,783,424"}}]
[null,null,"Grundstock Substanz",{"$f":"Vermentw.!K14","v":{"v":7600000,"d":"7,600,000"}}]

{"sheet":"Einn._Ausg.","index":10,"n_rows":30,"n_cols":7,"rows_kept":30}
[]
[]
[]
[null,"Einnahmen (ohne Vermögenserträge):"]
[]
[null,"EUR",{"$f":"Einstellungen!D7","v":2019},{"$f":"C6+1","v":2020},{"$f":"D6+1","v":2021},2022,2023]
[null,"Spenden",{"v":5000,"d":"5,000"},{"$f":"C7","v":{"v":5000,"d":"5,000"}},{"$f":"D7","v":{"v":5000,"d":"5,000"}},{"v":5000,"d":"5,000"},{"v":5000,"d":"5,000"}]
[null,"Zustiftungen",0,{"$f":"C8","v":0},0,0,0]
[null,"Zuwendungen in Rücklagen",0,{"$f":"C9","v":0},0,0,0]
[null,"Sonstige Einnahmen",0,0,0,0,0]
[null,"Summe",{"$f":"SUM(C7:C10)","v":{"v":5000,"d":"5,000"}},{"$f":"SUM(D7:D10)","v":{"v":5000,"d":"5,000"}},{"v":5000,"d":"5,000"},{"v":5000,"d":"5,000"},{"v":5000,"d":"5,000"}]
[]
[]
[null,"Allgemeine Verwaltungskosten (ohne Projektkosten zur Zweckverwirklichung)"]
[]
[null,"EUR",{"$f":"C6","v":2019},2020,2021,2022,2023]
[null,"Personalkosten",{"v":8000,"d":"8,000"},{"$f":"IF(Einstellungen!$K$32='Daten Einstellg_Ziele'!$E$21,'Einn._Ausg.'!C17,'Einn._Ausg.'!C17+'Einn._Ausg.'!C17*Einstellungen!$K$25)","v":{"v":8160,"d":"8,160"}},{"$f":"IF(Einstellungen!$K$32='Daten Einstellg_Ziele'!$E$21,'Einn._Ausg.'!D17,'Einn._Ausg.'!D17+'Einn._Ausg.'!D17*Einstellungen!$K$26)","v":{"v":8323.2,"d":"8,323"}},{"$f":"IF(Einstellungen!$K$32='Daten Einstellg_Ziele'!$E$21,'Einn._Ausg.'!E17,'Einn._Ausg.'!E17+'Einn._Ausg.'!E17*Einstellungen!$K$27)","v":{"v":8489.664,"d":"8,490"}},{"$f":"IF(Einstellungen!$K$32='Daten Einstellg_Ziele'!$E$21,'Einn._Ausg.'!F17,'Einn._Ausg.'!F17+'Einn._Ausg.'!F17*Einstellungen!$K$28)","v":{"v":8659.45728,"d":"8,659"}}]
[null,"Raummieten",{"v":6000,"d":"6,000"},{"$f":"IF(Einstellungen!$K$32='Daten Einstellg_Ziele'!$E$21,'Einn._Ausg.'!C18,'Einn._Ausg.'!C18+'Einn._Ausg.'!C18*Einstellungen!$K$25)","v":{"v":6120,"d":"6,120"}},{"$f":"IF(Einstellungen!$K$32='Daten Einstellg_Ziele'!$E$21,'Einn._Ausg.'!D18,'Einn._Ausg.'!D18+'Einn._Ausg.'!D18*Einstellungen!$K$26)","v":{"v":6242.4,"d":"6,242"}},{"$f":"IF(Einstellungen!$K$32='Daten Einstellg_Ziele'!$E$21,'Einn._Ausg.'!E18,'Einn._Ausg.'!E18+'Einn._Ausg.'!E18*Einstellungen!$K$27)","v":{"v":6367.248,"d":"6,367"}},{"$f":"IF(Einstellungen!$K$32='Daten Einstellg_Ziele'!$E$21,'Einn._Ausg.'!F18,'Einn._Ausg.'!F18+'Einn._Ausg.'!F18*Einstellungen!$K$28)","v":{"v":6494.59296,"d":"6,495"}}]
[null,"Sachkosten",{"v":1000,"d":"1,000"},{"$f":"IF(Einstellungen!$K$32='Daten Einstellg_Ziele'!$E$21,'Einn._Ausg.'!C19,'Einn._Ausg.'!C19+'Einn._Ausg.'!C19*Einstellungen!$K$25)","v":{"v":1020,"d":"1,020"}},{"$f":"IF(Einstellungen!$K$32='Daten Einstellg_Ziele'!$E$21,'Einn._Ausg.'!D19,'Einn._Ausg.'!D19+'Einn._Ausg.'!D19*Einstellungen!$K$26)","v":{"v":1040.4,"d":"1,040"}},{"$f":"IF(Einstellungen!$K$32='Daten Einstellg_Ziele'!$E$21,'Einn._Ausg.'!E19,'Einn._Ausg.'!E19+'Einn._Ausg.'!E19*Einstellungen!$K$27)","v":{"v":1061.208,"d":"1,061"}},{"$f":"IF(Einstellungen!$K$32='Daten Einstellg_Ziele'!$E$21,'Einn._Ausg.'!F19,'Einn._Ausg.'!F19+'Einn._Ausg.'!F19*Einstellungen!$K$28)","v":{"v":1082.43216,"d":"1,082"}}]
[null,"Reisekosten",{"v":2000,"d":"2,000"},{"$f":"IF(Einstellungen!$K$32='Daten Einstellg_Ziele'!$E$21,'Einn._Ausg.'!C20,'Einn._Ausg.'!C20+'Einn._Ausg.'!C20*Einstellungen!$K$25)","v":{"v":2040,"d":"2,040"}},{"$f":"IF(Einstellungen!$K$32='Daten Einstellg_Ziele'!$E$21,'Einn._Ausg.'!D20,'Einn._Ausg.'!D20+'Einn._Ausg.'!D20*Einstellungen!$K$26)","v":{"v":2080.8,"d":"2,081"}},{"$f":"IF(Einstellungen!$K$32='Daten Einstellg_Ziele'!$E$21,'Einn._Ausg.'!E20,'Einn._Ausg.'!E20+'Einn._Ausg.'!E20*Einstellungen!$K$27)","v":{"v":2122.416,"d":"2,122"}},{"$f":"IF(Einstellungen!$K$32='Daten Einstellg_Ziele'!$E$21,'Einn._Ausg.'!F20,'Einn._Ausg.'!F20+'Einn._Ausg.'!F20*Einstellungen!$K$28)","v":{"v":2164.86432,"d":"2,165"}}]
[null,"Rechtsberatung",{"v":1500,"d":"1,500"},0,{"$f":"IF(Einstellungen!$K$32='Daten Einstellg_Ziele'!$E$21,'Einn._Ausg.'!D21,'Einn._Ausg.'!D21+'Einn._Ausg.'!D21*Einstellungen!$K$26)","v":0},{"$f":"IF(Einstellungen!$K$32='Daten Einstellg_Ziele'!$E$21,'Einn._Ausg.'!E21,'Einn._Ausg.'!E21+'Einn._Ausg.'!E21*Einstellungen!$K$27)","v":0},{"$f":"IF(Einstellungen!$K$32='Daten Einstellg_Ziele'!$E$21,'Einn._Ausg.'!F21,'Einn._Ausg.'!F21+'Einn._Ausg.'!F21*Einstellungen!$K$28)","v":0}]
[null,"Rechnungslegung/Abschluss",{"v":2500,"d":"2,500"},{"$f":"IF(Einstellungen!$K$32='Daten Einstellg_Ziele'!$E$21,'Einn._Ausg.'!C22,'Einn._Ausg.'!C22+'Einn._Ausg.'!C22*Einstellungen!$K$25)","v":{"v":2550,"d":"2,550"}},{"$f":"IF(Einstellungen!$K$32='Daten Einstellg_Ziele'!$E$21,'Einn._Ausg.'!D22,'Einn._Ausg.'!D22+'Einn._Ausg.'!D22*Einstellungen!$K$26)","v":{"v":2601,"d":"2,601"}},{"$f":"IF(Einstellungen!$K$32='Daten Einstellg_Ziele'!$E$21,'Einn._Ausg.'!E22,'Einn._Ausg.'!E22+'Einn._Ausg.'!E22*Einstellungen!$K$27)","v":{"v":2653.02,"d":"2,653"}},{"$f":"IF(Einstellungen!$K$32='Daten Einstellg_Ziele'!$E$21,'Einn._Ausg.'!F22,'Einn._Ausg.'!F22+'Einn._Ausg.'!F22*Einstellungen!$K$28)","v":{"v":2706.0804,"d":"2,706"}}]
[null,"Prüfungskosten",{"v":1000,"d":"1,000"},{"$f":"IF(Einstellungen!$K$32='Daten Einstellg_Ziele'!$E$21,'Einn._Ausg.'!C23,'Einn._Ausg.'!C23+'Einn._Ausg.'!C23*Einstellungen!$K$25)","v":{"v":1020,"d":"1,020"}},{"$f":"IF(Einstellungen!$K$32='Daten Einstellg_Ziele'!$E$21,'Einn._Ausg.'!D23,'Einn._Ausg.'!D23+'Einn._Ausg.'!D23*Einstellungen!$K$26)","v":{"v":1040.4,"d":"1,040"}},{"$f":"IF(Einstellungen!$K$32='Daten Einstellg_Ziele'!$E$21,'Einn._Ausg.'!E23,'Einn._Ausg.'!E23+'Einn._Ausg.'!E23*Einstellungen!$K$27)","v":{"v":1061.208,"d":"1,061"}},{"$f":"IF(Einstellungen!$K$32='Daten Einstellg_Ziele'!$E$21,'Einn._Ausg.'!F23,'Einn._Ausg.'!F23+'Einn._Ausg.'!F23*Einstellungen!$K$28)","v":{"v":1082.43216,"d":"1,082"}}]
[null,"Vermögensberatung",0,{"$f":"IF(Einstellungen!$K$32='Daten Einstellg_Ziele'!$E$21,'Einn._Ausg.'!C24,'Einn._Ausg.'!C24+'Einn._Ausg.'!C24*Einstellungen!$K$25)","v":0},{"$f":"IF(Einstellungen!$K$32='Daten Einstellg_Ziele'!$E$21,'Einn._Ausg.'!D24,'Einn._Ausg.'!D24+'Einn._Ausg.'!D24*Einstellungen!$K$26)","v":0},{"$f":"IF(Einstellungen!$K$32='Daten Einstellg_Ziele'!$E$21,'Einn._Ausg.'!E24,'Einn._Ausg.'!E24+'Einn._Ausg.'!E24*Einstellungen!$K$27)","v":0},{"$f":"IF(Einstellungen!$K$32='Daten Einstellg_Ziele'!$E$21,'Einn._Ausg.'!F24,'Einn._Ausg.'!F24+'Einn._Ausg.'!F24*Einstellungen!$K$28)","v":0}]
[null,"Marketing/PR",{"v":3000,"d":"3,000"},{"$f":"IF(Einstellungen!$K$32='Daten Einstellg_Ziele'!$E$21,'Einn._Ausg.'!C25,'Einn._Ausg.'!C25+'Einn._Ausg.'!C25*Einstellungen!$K$25)","v":{"v":3060,"d":"3,060"}},{"$f":"IF(Einstellungen!$K$32='Daten Einstellg_Ziele'!$E$21,'Einn._Ausg.'!D25,'Einn._Ausg.'!D25+'Einn._Ausg.'!D25*Einstellungen!$K$26)","v":{"v":3121.2,"d":"3,121"}},{"$f":"IF(Einstellungen!$K$32='Daten Einstellg_Ziele'!$E$21,'Einn._Ausg.'!E25,'Einn._Ausg.'!E25+'Einn._Ausg.'!E25*Einstellungen!$K$27)","v":{"v":3183.624,"d":"3,184"}},{"$f":"IF(Einstellungen!$K$32='Daten Einstellg_Ziele'!$E$21,'Einn._Ausg.'!F25,'Einn._Ausg.'!F25+'Einn._Ausg.'!F25*Einstellungen!$K$28)","v":{"v":3247.29648,"d":"3,247"}}]
[null,"Fundraising",0,{"$f":"IF(Einstellungen!$K$32='Daten Einstellg_Ziele'!$E$21,'Einn._Ausg.'!C26,'Einn._Ausg.'!C26+'Einn._Ausg.'!C26*Einstellungen!$K$25)","v":0},{"$f":"IF(Einstellungen!$K$32='Daten Einstellg_Ziele'!$E$21,'Einn._Ausg.'!D26,'Einn._Ausg.'!D26+'Einn._Ausg.'!D26*Einstellungen!$K$26)","v":0},{"$f":"IF(Einstellungen!$K$32='Daten Einstellg_Ziele'!$E$21,'Einn._Ausg.'!E26,'Einn._Ausg.'!E26+'Einn._Ausg.'!E26*Einstellungen!$K$27)","v":0},{"$f":"IF(Einstellungen!$K$32='Daten Einstellg_Ziele'!$E$21,'Einn._Ausg.'!F26,'Einn._Ausg.'!F26+'Einn._Ausg.'!F26*Einstellungen!$K$28)","v":0}]
[null,"Sonstige Aufwände",{"v":3000,"d":"3,000"},{"$f":"IF(Einstellungen!$K$32='Daten Einstellg_Ziele'!$E$21,'Einn._Ausg.'!C27,'Einn._Ausg.'!C27+'Einn._Ausg.'!C27*Einstellungen!$K$25)","v":{"v":3060,"d":"3,060"}},{"$f":"IF(Einstellungen!$K$32='Daten Einstellg_Ziele'!$E$21,'Einn._Ausg.'!D27,'Einn._Ausg.'!D27+'Einn._Ausg.'!D27*Einstellungen!$K$26)","v":{"v":3121.2,"d":"3,121"}},{"$f":"IF(Einstellungen!$K$32='Daten Einstellg_Ziele'!$E$21,'Einn._Ausg.'!E27,'Einn._Ausg.'!E27+'Einn._Ausg.'!E27*Einstellungen!$K$27)","v":{"v":3183.624,"d":"3,184"}},{"$f":"IF(Einstellungen!$K$32='Daten Einstellg_Ziele'!$E$21,'Einn._Ausg.'!F27,'Einn._Ausg.'!F27+'Einn._Ausg.'!F27*Einstellungen!$K$28)","v":{"v":3247.29648,"d":"3,247"}}]
[null,"Summe",{"$f":"SUM(C17:C27)","v":{"v":28000,"d":"28,000"}},{"$f":"SUM(D17:D27)","v":{"v":27030,"d":"27,030"}},{"v":27570.600000000002,"d":"27,571"},{"v":28122.012,"d":"28,122"},{"v":28684.452240000002,"d":"28,684"}]
[]
[null,"--- Ende der Eingaben ---"]

{"sheet":"Annahmen","index":11,"n_rows":20,"n_cols":17,"rows_kept":20}
[]
[]
[]
[null,"Basisszenario (linear)",{"$nulls":6},"Szenario Worst Case",{"$nulls":4},"Szenario 2"]
[{"$nulls":3},"Wertveränderg.","Bruttoertrag","Bruttoertrag","Kosten der VV.",null,"Abweichung","Abweichung",null,"Ausfall im ",null,"Abweichung","Abweichung",null,"Ausfall im "]
[null,"Nr.","Vermögensgegenstand","% p.a.","% p.a.","EUR p.a.","EUR p.a.",null,"Wert in %","Ertrag in %","Jahr","Jahr",null,{"$f":"I6","v":"Wert in %"},{"$f":"J6","v":"Ertrag in %"},"Jahr",{"$f":"L6","v":"Jahr"}]
[null,{"$f":"Vermentw.!B5","v":1},{"$f":"IF(Vermentw.!C5<>0,Vermentw.!C5,\"\")","v":"Vermögensverwaltung A-Bank Aktien"},{"v":0.03,"d":"3.0%"},{"v":0.025,"d":"2.5%"},{"$f":"IF(Vermentw.!D5<>0,Vermentw.!D5*Annahmen!E7,\"\")","v":{"v":16250,"d":"16,250"}},{"v":6000,"d":"6,000"},null,{"v":-0.3,"d":"-30.0%"},null,2020,"Kein Ausfall",{"$nulls":3},"Bitte ausw.","Kein Ausfall"]
[null,{"$f":"Vermentw.!B6","v":2},{"$f":"IF(Vermentw.!C6<>0,Vermentw.!C6,\"\")","v":"Vermögensverwaltung A-Bank Renten"},{"v":0.005,"d":"0.5%"},{"v":0.005,"d":"0.5%"},{"$f":"IF(Vermentw.!D6<>0,Vermentw.!D6*Annahmen!E8,\"\")","v":{"v":26000,"d":"26,000"}},null,null,{"v":-0.1,"d":"-10.0%"},null,2020,"Kein Ausfall",{"$nulls":4},"Kein Ausfall"]
[null,{"$f":"Vermentw.!B7","v":3},{"$f":"IF(Vermentw.!C7<>0,Vermentw.!C7,\"\")","v":"Stiftungsfonds Xy"},{"v":0.005,"d":"0.5%"},{"v":0.025,"d":"2.5%"},{"$f":"IF(Vermentw.!D7<>0,Vermentw.!D7*Annahmen!E9,\"\")","v":{"v":6250,"d":"6,250"}},null,null,{"v":0,"d":"0.0%"},null,2020,"Kein Ausfall",{"$nulls":4},"Kein Ausfall"]
[null,{"$f":"Vermentw.!B8","v":4},{"$f":"IF(Vermentw.!C8<>0,Vermentw.!C8,\"\")","v":"Immobilie"},{"v":0.01,"d":"1.0%"},{"v":0.02,"d":"2.0%"},{"$f":"IF(Vermentw.!D8<>0,Vermentw.!D8*Annahmen!E10,\"\")","v":{"v":10000,"d":"10,000"}},{"v":5000,"d":"5,000"},null,{"v":0,"d":"0.0%"},null,2020,"Kein Ausfall",{"$nulls":4},"Kein Ausfall"]
[null,{"$f":"Vermentw.!B9","v":5},{"$f":"IF(Vermentw.!C9<>0,Vermentw.!C9,\"\")","v":"Bankguthaben B-Bank"},{"v":0,"d":"0.0%"},{"v":0,"d":"0.0%"},{"$f":"IF(Vermentw.!D9<>0,Vermentw.!D9*Annahmen!E11,\"\")","v":0},null,null,{"v":0,"d":"0.0%"},null,"Bitte ausw.","Kein Ausfall",{"$nulls":4},"Kein Ausfall"]
[null,{"$f":"Vermentw.!B10","v":6},{"$f":"IF(Vermentw.!C10<>0,Vermentw.!C10,\"\")","v":""},{"v":0,"d":"0.0%"},{"v":0,"d":"0.0%"},{"$f":"IF(Vermentw.!D10<>0,Vermentw.!D10*Annahmen!E12,\"\")","v":""},null,null,{"v":0,"d":"0.0%"},null,"Bitte ausw.","Kein Ausfall",{"$nulls":4},"Kein Ausfall"]
[null,{"$f":"Vermentw.!B11","v":7},{"$f":"IF(Vermentw.!C11<>0,Vermentw.!C11,\"\")","v":""},{"v":0,"d":"0.0%"},{"v":0,"d":"0.0%"},{"$f":"IF(Vermentw.!D11<>0,Vermentw.!D11*Annahmen!E13,\"\")","v":""},null,null,{"v":0,"d":"0.0%"},null,"Bitte ausw.","Kein Ausfall",{"$nulls":4},"Kein Ausfall"]
[null,{"$f":"Vermentw.!B12","v":8},{"$f":"IF(Vermentw.!C12<>0,Vermentw.!C12,\"\")","v":""},{"v":0,"d":"0.0%"},{"v":0,"d":"0.0%"},{"$f":"IF(Vermentw.!D12<>0,Vermentw.!D12*Annahmen!E14,\"\")","v":""},null,null,{"v":0,"d":"0.0%"},null,"Bitte ausw.","Kein Ausfall",{"$nulls":4},"Kein Ausfall"]
[null,{"$f":"Vermentw.!B13","v":9},{"$f":"IF(Vermentw.!C13<>0,Vermentw.!C13,\"\")","v":""},{"v":0,"d":"0.0%"},{"v":0,"d":"0.0%"},{"$f":"IF(Vermentw.!D13<>0,Vermentw.!D13*Annahmen!E15,\"\")","v":""},null,null,{"v":0,"d":"0.0%"},null,"Bitte ausw.","Kein Ausfall",{"$nulls":4},"Kein Ausfall"]
[null,{"$f":"Vermentw.!B14","v":10},{"$f":"IF(Vermentw.!C14<>0,Vermentw.!C14,\"\")","v":""},{"v":0,"d":"0.0%"},{"v":0.04,"d":"4.0%"},{"$f":"IF(Vermentw.!D14<>0,Vermentw.!D14*Annahmen!E16,\"\")","v":""},null,null,{"v":0,"d":"0.0%"},null,"Bitte ausw.","Kein Ausfall",{"$nulls":4},"Kein Ausfall"]
[null,{"$f":"Vermentw.!B15","v":11},{"$f":"IF(Vermentw.!C15<>0,Vermentw.!C15,\"\")","v":""},{"v":0.01,"d":"1.0%"},{"v":0.05,"d":"5.0%"},{"$f":"IF(Vermentw.!D15<>0,Vermentw.!D15*Annahmen!E17,\"\")","v":""},null,null,{"v":0,"d":"0.0%"},null,"Bitte ausw.","Kein Ausfall",{"$nulls":4},"Kein Ausfall"]
[null,12,{"$f":"IF(Vermentw.!C16<>0,Vermentw.!C16,\"\")","v":""},{"v":0.015,"d":"1.5%"},{"v":0.03,"d":"3.0%"},{"$f":"IF(Vermentw.!D16<>0,Vermentw.!D16*Annahmen!E18,\"\")","v":""},null,null,{"v":0,"d":"0.0%"},null,"Bitte ausw.","Kein Ausfall",{"$nulls":4},"Kein Ausfall"]
[]
[null,"--- Ende der Eingaben ---"]

{"sheet":"Daten Projektion","index":12,"n_rows":188,"n_cols":13,"rows_kept":188,"hidden":true,"merged":[[102,6,102,7],[103,6,103,7],[142,6,142,7],[143,6,143,7],[144,6,144,7]]}
["Daten Projektion Annahmen",null,null,"Daten Projektion"]
[]
[{"$nulls":5},"Vermögen"]
[]
[null,"Szenariojahr","Ausfalljahr",null,"Nr.","Vermögensgegenstand","Anlageklasse","Wert EUR",{"$f":"Einstellungen!D7","v":2019},{"$f":"I5+1","v":2020},{"$f":"J5+1","v":2021},2022,2023]
[null,"Bitte ausw.","Kein Ausfall",null,{"$f":"Vermentw.!B5","v":1},{"$f":"Vermentw.!C5","v":"Vermögensverwaltung A-Bank Aktien"},{"$f":"Vermentw.!E5","v":"Aktien"},{"$f":"IF(G6=\"Verbindlichkeiten\",Vermentw.!D5*-1,Vermentw.!D5)","v":{"v":650000,"d":"650,000"}},{"$f":"H6+H6*Annahmen!$D7","v":{"v":669500,"d":"669,500"}},{"$f":"I6+I6*Annahmen!$D7","v":{"v":689585,"d":"689,585"}},{"$f":"J6+J6*Annahmen!$D7","v":{"v":710272.55,"d":"710,273"}},{"$f":"K6+K6*Annahmen!$D7","v":{"v":731580.7265000001,"d":"731,581"}},{"$f":"L6+L6*Annahmen!$D7","v":{"v":753528.1482950001,"d":"753,528"}}]
[null,{"$f":"Einstellungen!D7","v":2019},{"$f":"Einstellungen!D7","v":2019},null,{"$f":"Vermentw.!B6","v":2},{"$f":"Vermentw.!C6","v":"Vermögensverwaltung A-Bank Renten"},{"$f":"Vermentw.!E6","v":"Renten"},{"$f":"IF(G7=\"Verbindlichkeiten\",Vermentw.!D6*-1,Vermentw.!D6)","v":{"v":5200000,"d":"5,200,000"}},{"$f":"H7+H7*Annahmen!$D8","v":{"v":5226000,"d":"5,226,000"}},{"$f":"I7+I7*Annahmen!$D8","v":{"v":5252130,"d":"5,252,130"}},{"$f":"J7+J7*Annahmen!$D8","v":{"v":5278390.65,"d":"5,278,391"}},{"$f":"K7+K7*Annahmen!$D8","v":{"v":5304782.603250001,"d":"5,304,783"}},{"$f":"L7+L7*Annahmen!$D8","v":{"v":5331306.516266251,"d":"5,331,307"}}]
[null,{"$f":"B7+1","v":2020},{"$f":"C7+1","v":2020},null,{"$f":"Vermentw.!B7","v":3},{"$f":"Vermentw.!C7","v":"Stiftungsfonds Xy"},{"$f":"Vermentw.!E7","v":"Renten"},{"$f":"IF(G8=\"Verbindlichkeiten\",Vermentw.!D7*-1,Vermentw.!D7)","v":{"v":250000,"d":"250,000"}},{"$f":"H8+H8*Annahmen!$D9","v":{"v":251250,"d":"251,250"}},{"$f":"I8+I8*Annahmen!$D9","v":{"v":252506.25,"d":"252,506"}},{"$f":"J8+J8*Annahmen!$D9","v":{"v":253768.78125,"d":"253,769"}},{"$f":"K8+K8*Annahmen!$D9","v":{"v":255037.62515625,"d":"255,038"}},{"$f":"L8+L8*Annahmen!$D9","v":{"v":256312.81328203125,"d":"256,313"}}]
[null,{"$f":"B8+1","v":2021},2021,null,{"$f":"Vermentw.!B8","v":4},{"$f":"Vermentw.!C8","v":"Immobilie"},{"$f":"Vermentw.!E8","v":"Immobilien"},{"$f":"IF(G9=\"Verbindlichkeiten\",Vermentw.!D8*-1,Vermentw.!D8)","v":{"v":500000,"d":"500,000"}},{"$f":"H9+H9*Annahmen!$D10","v":{"v":505000,"d":"505,000"}},{"$f":"I9+I9*Annahmen!$D10","v":{"v":510050,"d":"510,050"}},{"$f":"J9+J9*Annahmen!$D10","v":{"v":515150.5,"d":"515,151"}},{"$f":"K9+K9*Annahmen!$D10","v":{"v":520302.005,"d":"520,302"}},{"$f":"L9+L9*Annahmen!$D10","v":{"v":525505.02505,"d":"525,505"}}]
[null,2022,2022,null,{"$f":"Vermentw.!B9","v":5},{"$f":"Vermentw.!C9","v":"Bankguthaben B-Bank"},{"$f":"Vermentw.!E9","v":"Kontoguthaben"},{"$f":"IF(G10=\"Verbindlichkeiten\",Vermentw.!D9*-1,Vermentw.!D9)","v":{"v":1000000,"d":"1,000,000"}},{"$f":"H10+H10*Annahmen!$D11","v":{"v":1000000,"d":"1,000,000"}},{"$f":"I10+I10*Annahmen!$D11","v":{"v":1000000,"d":"1,000,000"}},{"$f":"J10+J10*Annahmen!$D11","v":{"v":1000000,"d":"1,000,000"}},{"$f":"K10+K10*Annahmen!$D11","v":{"v":1000000,"d":"1,000,000"}},{"$f":"L10+L10*Annahmen!$D11","v":{"v":1000000,"d":"1,000,000"}}]
[null,2023,2023,null,{"$f":"Vermentw.!B10","v":6},{"$f":"Vermentw.!C10","v":0},{"$f":"Vermentw.!E10","v":"Bitte auswählen"},{"$f":"IF(G11=\"Verbindlichkeiten\",Vermentw.!D10*-1,Vermentw.!D10)","v":0},{"$f":"H11+H11*Annahmen!$D12","v":0},{"$f":"I11+I11*Annahmen!$D12","v":0},{"$f":"J11+J11*Annahmen!$D12","v":0},{"$f":"K11+K11*Annahmen!$D12","v":0},{"$f":"L11+L11*Annahmen!$D12","v":0}]
[{"$nulls":4},{"$f":"Vermentw.!B11","v":7},{"$f":"Vermentw.!C11","v":0},{"$f":"Vermentw.!E11","v":"Bitte auswählen"},{"$f":"IF(G12=\"Verbindlichkeiten\",Vermentw.!D11*-1,Vermentw.!D11)","v":0},{"$f":"H12+H12*Annahmen!$D13","v":0},{"$f":"I12+I12*Annahmen!$D13","v":0},{"$f":"J12+J12*Annahmen!$D13","v":0},{"$f":"K12+K12*Annahmen!$D13","v":0},{"$f":"L12+L12*Annahmen!$D13","v":0}]
[{"$nulls":4},{"$f":"Vermentw.!B12","v":8},{"$f":"Vermentw.!C12","v":0},{"$f":"Vermentw.!E12","v":"Bitte auswählen"},{"$f":"IF(G13=\"Verbindlichkeiten\",Vermentw.!D12*-1,Vermentw.!D12)","v":0},{"$f":"H13+H13*Annahmen!$D14","v":0},{"$f":"I13+I13*Annahmen!$D14","v":0},{"$f":"J13+J13*Annahmen!$D14","v":0},{"$f":"K13+K13*Annahmen!$D14","v":0},{"$f":"L13+L13*Annahmen!$D14","v":0}]
[{"$nulls":4},{"$f":"Vermentw.!B13","v":9},{"$f":"Vermentw.!C13","v":0},{"$f":"Vermentw.!E13","v":"Bitte auswählen"},{"$f":"IF(G14=\"Verbindlichkeiten\",Vermentw.!D13*-1,Vermentw.!D13)","v":0},{"$f":"H14+H14*Annahmen!$D15","v":0},{"$f":"I14+I14*Annahmen!$D15","v":0},{"$f":"J14+J14*Annahmen!$D15","v":0},{"$f":"K14+K14*Annahmen!$D15","v":0},{"$f":"L14+L14*Annahmen!$D15","v":0}]
[{"$nulls":4},{"$f":"Vermentw.!B14","v":10},{"$f":"Vermentw.!C14","v":0},{"$f":"Vermentw.!E14","v":"Bitte auswählen"},{"$f":"IF(G15=\"Verbindlichkeiten\",Vermentw.!D14*-1,Vermentw.!D14)","v":0},{"$f":"H15+H15*Annahmen!$D16","v":0},{"$f":"I15+I15*Annahmen!$D16","v":0},{"$f":"J15+J15*Annahmen!$D16","v":0},{"$f":"K15+K15*Annahmen!$D16","v":0},{"$f":"L15+L15*Annahmen!$D16","v":0}]
[{"$nulls":4},{"$f":"Vermentw.!B15","v":11},{"$f":"Vermentw.!C15","v":0},{"$f":"Vermentw.!E15","v":"Bitte auswählen"},{"$f":"IF(G16=\"Verbindlichkeiten\",Vermentw.!D15*-1,Vermentw.!D15)","v":0},{"$f":"H16+H16*Annahmen!$D17","v":0},{"$f":"I16+I16*Annahmen!$D17","v":0},{"$f":"J16+J16*Annahmen!$D17","v":0},{"$f":"K16+K16*Annahmen!$D17","v":0},{"$f":"L16+L16*Annahmen!$D17","v":0}]
[{"$nulls":4},{"$f":"Vermentw.!B16","v":12},{"$f":"Vermentw.!C16","v":0},{"$f":"Vermentw.!E16","v":"Bitte auswählen"},{"$f":"IF(G17=\"Verbindlichkeiten\",Vermentw.!D16*-1,Vermentw.!D16)","v":0},{"$f":"H17+H17*Annahmen!$D18","v":0},{"$f":"I17+I17*Annahmen!$D18","v":0},{"$f":"J17+J17*Annahmen!$D18","v":0},{"$f":"K17+K17*Annahmen!$D18","v":0},{"$f":"L17+L17*Annahmen!$D18","v":0}]
[{"$nulls":5},"Summe",null,{"$f":"SUM(H6:H17)","v":{"v":7600000,"d":"7,600,000"}},{"$f":"SUM(I6:I17)","v":{"v":7651750,"d":"7,651,750"}},{"v":7704271.25,"d":"7,704,271"},{"v":7757582.48125,"d":"7,757,582"},{"v":7811702.95990625,"d":"7,811,703"},{"v":7866652.502893283,"d":"7,866,653"}]
[]
[{"$nulls":5},"Vermögen nach Anlageklassen","Immobilien",{"$f":"SUMIF($G6:$G17,G20,H6:H17)","v":{"v":500000,"d":"500,000"}},{"$f":"SUMIF($G$6:$G$17,$G$20,I$6:I$17)","v":{"v":505000,"d":"505,000"}},{"v":510050,"d":"510,050"},{"v":515150.5,"d":"515,151"},{"v":520302.005,"d":"520,302"},{"v":525505.02505,"d":"525,505"}]
[{"$nulls":6},{"$f":"'Daten Vermögen'!B7","v":"Beteiligungen"},{"$f":"SUMIF($G$6:$G$17,$G$21,$H$6:H$17)","v":0},{"$f":"SUMIF($G$6:$G$17,$G$21,$H$6:I$17)","v":0},{"$f":"SUMIF($G$6:$G$17,$G$21,$H$6:J$17)","v":0},{"$f":"SUMIF($G$6:$G$17,$G$21,$H$6:K$17)","v":0},{"$f":"SUMIF($G$6:$G$17,$G$21,$H$6:L$17)","v":0},{"$f":"SUMIF($G$6:$G$17,$G$21,$H$6:M$17)","v":0}]
[{"$nulls":6},"Wertpapiere",{"$f":"SUM(H23:H26)","v":{"v":6100000,"d":"6,100,000"}},{"v":6146750,"d":"6,146,750"},{"v":6194221.25,"d":"6,194,221"},{"v":6242431.98125,"d":"6,242,432"},{"v":6291400.95490625,"d":"6,291,401"},{"v":6341147.477843283,"d":"6,341,147"}]
[{"$nulls":6}," davon Aktien",{"$f":"SUMIF($G$6:$G$17,'Daten Vermögen'!$B$8,H$6:H$17)","v":{"v":650000,"d":"650,000"}},{"$f":"SUMIF($G$6:$G$17,'Daten Vermögen'!$B$8,I$6:I$17)","v":{"v":669500,"d":"669,500"}},{"$f":"SUMIF($G$6:$G$17,'Daten Vermögen'!$B$8,J$6:J$17)","v":{"v":689585,"d":"689,585"}},{"$f":"SUMIF($G$6:$G$17,'Daten Vermögen'!$B$8,K$6:K$17)","v":{"v":710272.55,"d":"710,273"}},{"$f":"SUMIF($G$6:$G$17,'Daten Vermögen'!$B$8,L$6:L$17)","v":{"v":731580.7265000001,"d":"731,581"}},{"$f":"SUMIF($G$6:$G$17,'Daten Vermögen'!$B$8,M$6:M$17)","v":{"v":753528.1482950001,"d":"753,528"}}]
[{"$nulls":6}," davon Renten",{"$f":"SUMIF($G$6:$G$17,'Daten Vermögen'!$B$9,H$6:H$17)","v":{"v":5450000,"d":"5,450,000"}},{"$f":"SUMIF($G$6:$G$17,'Daten Vermögen'!$B$9,I$6:I$17)","v":{"v":5477250,"d":"5,477,250"}},{"$f":"SUMIF($G$6:$G$17,'Daten Vermögen'!$B$9,J$6:J$17)","v":{"v":5504636.25,"d":"5,504,636"}},{"$f":"SUMIF($G$6:$G$17,'Daten Vermögen'!$B$9,K$6:K$17)","v":{"v":5532159.43125,"d":"5,532,159"}},{"$f":"SUMIF($G$6:$G$17,'Daten Vermögen'!$B$9,L$6:L$17)","v":{"v":5559820.2284062505,"d":"5,559,820"}},{"$f":"SUMIF($G$6:$G$17,'Daten Vermögen'!$B$9,M$6:M$17)","v":{"v":5587619.329548283,"d":"5,587,619"}}]
[{"$nulls":6}," davon Liquidität",{"$f":"SUMIF($G$6:$G$17,$G$25,H$6:H$17)","v":0},{"$f":"SUMIF($G$6:$G$17,$G$25,I$6:I$17)","v":0},0,0,0,0]
[{"$nulls":6}," davon Alternative Investments",{"$f":"SUMIF($G$6:$G$17,$G$26,H$6:H$17)","v":0},{"$f":"SUMIF($G$6:$G$17,$G$26,I$6:I$17)","v":0},0,0,0,0]
[{"$nulls":6},"Spar- und Termineinlagen",{"$f":"SUMIF($G$6:$G$17,'Daten Vermögen'!$B$10,H$6:H$17)","v":0},{"$f":"SUMIF($G$6:$G$17,'Daten Vermögen'!$B$10,I$6:I$17)","v":0},{"$f":"SUMIF($G$6:$G$17,'Daten Vermögen'!$B$10,J$6:J$17)","v":0},{"$f":"SUMIF($G$6:$G$17,'Daten Vermögen'!$B$10,K$6:K$17)","v":0},{"$f":"SUMIF($G$6:$G$17,'Daten Vermögen'!$B$10,L$6:L$17)","v":0},{"$f":"SUMIF($G$6:$G$17,'Daten Vermögen'!$B$10,M$6:M$17)","v":0}]
[{"$nulls":6},"Kontoguthaben Investitionsvermögen",{"$f":"SUMIF($G$6:$G$17,'Daten Vermögen'!$B$11,H$6:H$17)","v":{"v":1000000,"d":"1,000,000"}},{"$f":"SUMIF($G$6:$G$17,'Daten Vermögen'!$B$11,I$6:I$17)","v":{"v":1000000,"d":"1,000,000"}},{"$f":"SUMIF($G$6:$G$17,'Daten Vermögen'!$B$11,J$6:J$17)","v":{"v":1000000,"d":"1,000,000"}},{"$f":"SUMIF($G$6:$G$17,'Daten Vermögen'!$B$11,K$6:K$17)","v":{"v":1000000,"d":"1,000,000"}},{"$f":"SUMIF($G$6:$G$17,'Daten Vermögen'!$B$11,L$6:L$17)","v":{"v":1000000,"d":"1,000,000"}},{"$f":"SUMIF($G$6:$G$17,'Daten Vermögen'!$B$11,M$6:M$17)","v":{"v":1000000,"d":"1,000,000"}}]
[{"$nulls":6},"Sonstiges Vermögen",{"$f":"SUMIF($G$6:$G$17,$G$29,H$6:H$17)","v":0},0,0,0,0,0]
[{"$nulls":6},"Verbindlichkeiten",{"$f":"SUMIF($G$6:$G$17,$G$30,H$6:H$17)","v":0},0,0,0,0,0]
[{"$nulls":6},"Summe",{"$f":"SUM(H20:H22)+SUM(H27:H30)","v":{"v":7600000,"d":"7,600,000"}},{"v":7651750,"d":"7,651,750"},{"v":7704271.25,"d":"7,704,271"},{"v":7757582.48125,"d":"7,757,582"},{"v":7811702.95990625,"d":"7,811,703"},{"v":7866652.502893283,"d":"7,866,653"}]
[]
[{"$nulls":5},"Erträge"]
[]
[null,null,"Erträge",null,{"$f":"E5","v":"Nr."},"Vermögensgegenstand","Anlageklasse","Ertrag EUR",{"$f":"I5","v":2019},{"$f":"J5","v":2020},{"$f":"K5","v":2021},{"$f":"L5","v":2022},{"$f":"M5","v":2023}]
[{"$nulls":4},1,"Vermögensverwaltung A-Bank Aktien","Aktien",{"$f":"IF(G36=\"Verbindlichkeiten\",-1,1)","v":1},{"$f":"H6*$H36*Annahmen!$E7","v":{"v":16250,"d":"16,250"}},{"$f":"I6*$H36*Annahmen!$E7","v":{"v":16737.5,"d":"16,738"}},{"$f":"J6*$H36*Annahmen!$E7","v":{"v":17239.625,"d":"17,240"}},{"$f":"K6*$H36*Annahmen!$E7","v":{"v":17756.81375,"d":"17,757"}},{"$f":"L6*$H36*Annahmen!$E7","v":{"v":18289.518162500004,"d":"18,290"}}]
[{"$nulls":4},2,"Vermögensverwaltung A-Bank Renten","Renten",{"$f":"IF(G37=\"Verbindlichkeiten\",-1,1)","v":1},{"$f":"H7*$H37*Annahmen!$E8","v":{"v":26000,"d":"26,000"}},{"$f":"I7*$H37*Annahmen!$E8","v":{"v":26130,"d":"26,130"}},{"$f":"J7*$H37*Annahmen!$E8","v":{"v":26260.65,"d":"26,261"}},{"$f":"K7*$H37*Annahmen!$E8","v":{"v":26391.953250000002,"d":"26,392"}},{"$f":"L7*$H37*Annahmen!$E8","v":{"v":26523.913016250004,"d":"26,524"}}]
[{"$nulls":4},3,"Stiftungsfonds Xy","Renten",1,{"$f":"H8*$H38*Annahmen!$E9","v":{"v":6250,"d":"6,250"}},{"$f":"I8*$H38*Annahmen!$E9","v":{"v":6281.25,"d":"6,281"}},{"$f":"J8*$H38*Annahmen!$E9","v":{"v":6312.65625,"d":"6,313"}},{"$f":"K8*$H38*Annahmen!$E9","v":{"v":6344.219531250001,"d":"6,344"}},{"$f":"L8*$H38*Annahmen!$E9","v":{"v":6375.94062890625,"d":"6,376"}}]
[{"$nulls":4},4,"Immobilie","Immobilien",1,{"$f":"H9*$H39*Annahmen!$E10","v":{"v":10000,"d":"10,000"}},{"$f":"I9*$H39*Annahmen!$E10","v":{"v":10100,"d":"10,100"}},{"$f":"J9*$H39*Annahmen!$E10","v":{"v":10201,"d":"10,201"}},{"$f":"K9*$H39*Annahmen!$E10","v":{"v":10303.01,"d":"10,303"}},{"$f":"L9*$H39*Annahmen!$E10","v":{"v":10406.0401,"d":"10,406"}}]
[{"$nulls":4},5,"Bankguthaben B-Bank","Kontoguthaben",1,{"$f":"H10*$H40*Annahmen!$E11","v":0},{"$f":"I10*$H40*Annahmen!$E11","v":0},{"$f":"J10*$H40*Annahmen!$E11","v":0},{"$f":"K10*$H40*Annahmen!$E11","v":0},{"$f":"L10*$H40*Annahmen!$E11","v":0}]
[{"$nulls":4},6,0,"Bitte auswählen",1,{"$f":"H11*$H41*Annahmen!$E12","v":0},{"$f":"I11*$H41*Annahmen!$E12","v":0},{"$f":"J11*$H41*Annahmen!$E12","v":0},{"$f":"K11*$H41*Annahmen!$E12","v":0},{"$f":"L11*$H41*Annahmen!$E12","v":0}]
[{"$nulls":4},7,0,"Bitte auswählen",1,{"$f":"H12*$H42*Annahmen!$E13","v":0},{"$f":"I12*$H42*Annahmen!$E13","v":0},{"$f":"J12*$H42*Annahmen!$E13","v":0},{"$f":"K12*$H42*Annahmen!$E13","v":0},{"$f":"L12*$H42*Annahmen!$E13","v":0}]
[{"$nulls":4},8,0,"Bitte auswählen",1,{"$f":"H13*$H43*Annahmen!$E14","v":0},{"$f":"I13*$H43*Annahmen!$E14","v":0},{"$f":"J13*$H43*Annahmen!$E14","v":0},{"$f":"K13*$H43*Annahmen!$E14","v":0},{"$f":"L13*$H43*Annahmen!$E14","v":0}]
[{"$nulls":4},9,0,"Bitte auswählen",1,{"$f":"H14*$H44*Annahmen!$E15","v":0},{"$f":"I14*$H44*Annahmen!$E15","v":0},{"$f":"J14*$H44*Annahmen!$E15","v":0},{"$f":"K14*$H44*Annahmen!$E15","v":0},{"$f":"L14*$H44*Annahmen!$E15","v":0}]
[{"$nulls":4},10,0,"Bitte auswählen",1,{"$f":"H15*$H45*Annahmen!$E16","v":0},{"$f":"I15*$H45*Annahmen!$E16","v":0},{"$f":"J15*$H45*Annahmen!$E16","v":0},{"$f":"K15*$H45*Annahmen!$E16","v":0},{"$f":"L15*$H45*Annahmen!$E16","v":0}]
[{"$nulls":4},11,0,"Bitte auswählen",1,{"$f":"H16*$H46*Annahmen!$E17","v":0},{"$f":"I16*$H46*Annahmen!$E17","v":0},{"$f":"J16*$H46*Annahmen!$E17","v":0},{"$f":"K16*$H46*Annahmen!$E17","v":0},{"$f":"L16*$H46*Annahmen!$E17","v":0}]
[{"$nulls":4},12,0,"Bitte auswählen",1,{"$f":"H17*$H47*Annahmen!$E18","v":0},{"$f":"I17*$H47*Annahmen!$E18","v":0},{"$f":"J17*$H47*Annahmen!$E18","v":0},{"$f":"K17*$H47*Annahmen!$E18","v":0},{"$f":"L17*$H47*Annahmen!$E18","v":0}]
[{"$nulls":5},{"$f":"F18","v":"Summe"},null,null,{"$f":"SUM(I36:I47)","v":{"v":58500,"d":"58,500"}},{"$f":"SUM(J36:J47)","v":{"v":59248.75,"d":"59,249"}},{"v":60013.93125,"d":"60,014"},{"v":60795.996531250006,"d":"60,796"},{"v":61595.41190765625,"d":"61,595"}]
[]
[{"$nulls":5},"Erträge nach Anlageklassen",{"$f":"G20","v":"Immobilien"},{"$f":"SUMIF($G36:$G47,$G$50,H36:H47)","v":1},{"$f":"SUMIF($G36:$G47,$G$50,I36:I47)","v":{"v":10000,"d":"10,000"}},{"v":10100,"d":"10,100"},{"v":10201,"d":"10,201"},{"v":10303.01,"d":"10,303"},{"v":10406.0401,"d":"10,406"}]
[{"$nulls":6},"Beteiligungen",{"$f":"SUMIF($G36:$G47,$G$51,H$36:H$47)","v":0},{"$f":"SUMIF($G36:$G47,$G$51,I$36:I$47)","v":0},0,0,0,0]
[{"$nulls":6},"Wertpapiere",{"$f":"SUM(H53:H56)","v":3},{"v":48500,"d":"48,500"},{"v":49148.75,"d":"49,149"},{"v":49812.93125,"d":"49,813"},{"v":50492.986531250004,"d":"50,493"},{"v":51189.37180765626,"d":"51,189"}]
[{"$nulls":6}," davon Aktien",{"$f":"SUMIF($G36:$G47,'Daten Vermögen'!$B$8,H36:H47)","v":1},{"$f":"SUMIF($G36:$G47,'Daten Vermögen'!$B$8,I36:I47)","v":{"v":16250,"d":"16,250"}},{"$f":"SUMIF($G36:$G47,'Daten Vermögen'!$B$8,J36:J47)","v":{"v":16737.5,"d":"16,738"}},{"$f":"SUMIF($G36:$G47,'Daten Vermögen'!$B$8,K36:K47)","v":{"v":17239.625,"d":"17,240"}},{"$f":"SUMIF($G36:$G47,'Daten Vermögen'!$B$8,L36:L47)","v":{"v":17756.81375,"d":"17,757"}},{"$f":"SUMIF($G36:$G47,'Daten Vermögen'!$B$8,M36:M47)","v":{"v":18289.518162500004,"d":"18,290"}}]
[{"$nulls":6}," davon Renten",{"$f":"SUMIF($G36:$G47,'Daten Vermögen'!$B$9,H36:H47)","v":2},{"$f":"SUMIF($G36:$G47,'Daten Vermögen'!$B$9,I36:I47)","v":{"v":32250,"d":"32,250"}},{"$f":"SUMIF($G36:$G47,'Daten Vermögen'!$B$9,J36:J47)","v":{"v":32411.25,"d":"32,411"}},{"$f":"SUMIF($G36:$G47,'Daten Vermögen'!$B$9,K36:K47)","v":{"v":32573.30625,"d":"32,573"}},{"$f":"SUMIF($G36:$G47,'Daten Vermögen'!$B$9,L36:L47)","v":{"v":32736.172781250003,"d":"32,736"}},{"$f":"SUMIF($G36:$G47,'Daten Vermögen'!$B$9,M36:M47)","v":{"v":32899.853645156254,"d":"32,900"}}]
[{"$nulls":6}," davon Liquidität",{"$f":"SUMIF($G36:$G47,$G$55,H36:H47)","v":0},{"$f":"SUMIF($G36:$G47,$G$55,I36:I47)","v":0},0,0,0,0]
[{"$nulls":6}," davon Alternative Investments",{"$f":"SUMIF($G36:$G47,$G$56,H36:H47)","v":0},{"$f":"SUMIF($G36:$G47,$G$56,I36:I47)","v":0},0,0,0,0]
[{"$nulls":6},"Spar- und Termineinlagen",{"$f":"SUMIF($G36:$G47,'Daten Vermögen'!$B$10,H36:H47)","v":0},{"$f":"SUMIF($G36:$G47,'Daten Vermögen'!$B$10,I36:I47)","v":0},{"$f":"SUMIF($G36:$G47,'Daten Vermögen'!$B$10,J36:J47)","v":0},{"$f":"SUMIF($G36:$G47,'Daten Vermögen'!$B$10,K36:K47)","v":0},{"$f":"SUMIF($G36:$G47,'Daten Vermögen'!$B$10,L36:L47)","v":0},{"$f":"SUMIF($G36:$G47,'Daten Vermögen'!$B$10,M36:M47)","v":0}]
[{"$nulls":6},"Kontoguthaben Investitionsvermögen",{"$f":"SUMIF($G36:$G47,'Daten Vermögen'!B11,H36:H47)","v":1},{"$f":"SUMIF($G36:$G47,'Daten Vermögen'!C11,I36:I47)","v":0},{"$f":"SUMIF($G36:$G47,'Daten Vermögen'!D11,J36:J47)","v":0},{"$f":"SUMIF($G36:$G47,'Daten Vermögen'!E11,K36:K47)","v":0},{"$f":"SUMIF($G36:$G47,'Daten Vermögen'!F11,L36:L47)","v":0},{"$f":"SUMIF($G36:$G47,'Daten Vermögen'!G11,M36:M47)","v":0}]
[{"$nulls":6},"Sonstiges Vermögen",{"$f":"SUMIF($G36:$G47,'Daten Vermögen'!$B$12,H36:H47)","v":0},{"$f":"SUMIF($G36:$G47,'Daten Vermögen'!$B$12,I36:I47)","v":0},{"$f":"SUMIF($G36:$G47,'Daten Vermögen'!$B$12,J36:J47)","v":0},{"$f":"SUMIF($G36:$G47,'Daten Vermögen'!$B$12,K36:K47)","v":0},{"$f":"SUMIF($G36:$G47,'Daten Vermögen'!$B$12,L36:L47)","v":0},{"$f":"SUMIF($G36:$G47,'Daten Vermögen'!$B$12,M36:M47)","v":0}]
[{"$nulls":6},"Verbindlichkeiten",{"$f":"SUMIF($G36:$G47,$G$60,H36:H47)","v":0},0,0,0,0,0]
[{"$nulls":6},"Summe",{"$f":"SUM(H50:H52)+SUM(H57:H60)","v":5},{"v":58500,"d":"58,500"},{"v":59248.75,"d":"59,249"},{"v":60013.93125,"d":"60,014"},{"v":60795.996531250006,"d":"60,796"},{"v":61595.41190765626,"d":"61,595"}]
[]
[{"$nulls":5},"Kosten"]
[]
[null,null,"Kosten",null,{"$f":"E35","v":"Nr."},"Vermögensgegenstand","Anlageklasse","Kosten EUR",{"$f":"I35","v":2019},{"$f":"J35","v":2020},{"$f":"K35","v":2021},{"$f":"L35","v":2022},{"$f":"M35","v":2023}]
[{"$nulls":4},1,"Vermögensverwaltung A-Bank Aktien","Aktien",{"$f":"Annahmen!G7","v":{"v":6000,"d":"6,000"}},{"$f":"H66+H66*Einstellungen!$K$24","v":{"v":6120,"d":"6,120"}},{"$f":"I66+I66*Einstellungen!$K$25","v":{"v":6242.4,"d":"6,242"}},{"$f":"J66+J66*Einstellungen!$K$26","v":{"v":6367.248,"d":"6,367"}},{"$f":"K66+K66*Einstellungen!$K$27","v":{"v":6494.59296,"d":"6,495"}},{"$f":"L66+L66*Einstellungen!$K$28","v":{"v":6624.4848192,"d":"6,624"}}]
[{"$nulls":4},2,"Vermögensverwaltung A-Bank Renten","Renten",{"$f":"Annahmen!G8","v":0},{"$f":"H67+H67*Einstellungen!$K$24","v":0},{"$f":"I67+I67*Einstellungen!$K$25","v":0},{"$f":"J67+J67*Einstellungen!$K$26","v":0},{"$f":"K67+K67*Einstellungen!$K$27","v":0},{"$f":"L67+L67*Einstellungen!$K$28","v":0}]
[{"$nulls":4},3,"Stiftungsfonds Xy","Renten",{"$f":"Annahmen!G9","v":0},{"$f":"H68+H68*Einstellungen!$K$24","v":0},{"$f":"I68+I68*Einstellungen!$K$25","v":0},{"$f":"J68+J68*Einstellungen!$K$26","v":0},{"$f":"K68+K68*Einstellungen!$K$27","v":0},{"$f":"L68+L68*Einstellungen!$K$28","v":0}]
[{"$nulls":4},4,"Immobilie","Immobilien",{"$f":"Annahmen!G10","v":{"v":5000,"d":"5,000"}},{"$f":"H69+H69*Einstellungen!$K$24","v":{"v":5100,"d":"5,100"}},{"$f":"I69+I69*Einstellungen!$K$25","v":{"v":5202,"d":"5,202"}},{"$f":"J69+J69*Einstellungen!$K$26","v":{"v":5306.04,"d":"5,306"}},{"$f":"K69+K69*Einstellungen!$K$27","v":{"v":5412.1608,"d":"5,412"}},{"$f":"L69+L69*Einstellungen!$K$28","v":{"v":5520.4040159999995,"d":"5,520"}}]
[{"$nulls":4},5,"Bankguthaben B-Bank","Kontoguthaben",{"$f":"Annahmen!G11","v":0},{"$f":"H70+H70*Einstellungen!$K$24","v":0},{"$f":"I70+I70*Einstellungen!$K$25","v":0},{"$f":"J70+J70*Einstellungen!$K$26","v":0},{"$f":"K70+K70*Einstellungen!$K$27","v":0},{"$f":"L70+L70*Einstellungen!$K$28","v":0}]
[{"$nulls":4},6,0,"Bitte auswählen",{"$f":"Annahmen!G12","v":0},{"$f":"H71+H71*Einstellungen!$K$24","v":0},{"$f":"I71+I71*Einstellungen!$K$25","v":0},{"$f":"J71+J71*Einstellungen!$K$26","v":0},{"$f":"K71+K71*Einstellungen!$K$27","v":0},{"$f":"L71+L71*Einstellungen!$K$28","v":0}]
[{"$nulls":4},7,0,"Bitte auswählen",{"$f":"Annahmen!G13","v":0},{"$f":"H72+H72*Einstellungen!$K$24","v":0},{"$f":"I72+I72*Einstellungen!$K$25","v":0},{"$f":"J72+J72*Einstellungen!$K$26","v":0},{"$f":"K72+K72*Einstellungen!$K$27","v":0},{"$f":"L72+L72*Einstellungen!$K$28","v":0}]
[{"$nulls":4},8,0,"Bitte auswählen",{"$f":"Annahmen!G14","v":0},{"$f":"H73+H73*Einstellungen!$K$24","v":0},{"$f":"I73+I73*Einstellungen!$K$25","v":0},{"$f":"J73+J73*Einstellungen!$K$26","v":0},{"$f":"K73+K73*Einstellungen!$K$27","v":0},{"$f":"L73+L73*Einstellungen!$K$28","v":0}]
[{"$nulls":4},9,0,"Bitte auswählen",{"$f":"Annahmen!G15","v":0},{"$f":"H74+H74*Einstellungen!$K$24","v":0},{"$f":"I74+I74*Einstellungen!$K$25","v":0},{"$f":"J74+J74*Einstellungen!$K$26","v":0},{"$f":"K74+K74*Einstellungen!$K$27","v":0},{"$f":"L74+L74*Einstellungen!$K$28","v":0}]
[{"$nulls":4},10,0,"Bitte auswählen",{"$f":"Annahmen!G16","v":0},{"$f":"H75+H75*Einstellungen!$K$24","v":0},{"$f":"I75+I75*Einstellungen!$K$25","v":0},{"$f":"J75+J75*Einstellungen!$K$26","v":0},{"$f":"K75+K75*Einstellungen!$K$27","v":0},{"$f":"L75+L75*Einstellungen!$K$28","v":0}]
[{"$nulls":4},11,0,"Bitte auswählen",{"$f":"Annahmen!G17","v":0},{"$f":"H76+H76*Einstellungen!$K$24","v":0},{"$f":"I76+I76*Einstellungen!$K$25","v":0},{"$f":"J76+J76*Einstellungen!$K$26","v":0},{"$f":"K76+K76*Einstellungen!$K$27","v":0},{"$f":"L76+L76*Einstellungen!$K$28","v":0}]
[{"$nulls":4},12,0,"Bitte auswählen",{"$f":"Annahmen!G18","v":0},{"$f":"H77+H77*Einstellungen!$K$24","v":0},{"$f":"I77+I77*Einstellungen!$K$25","v":0},{"$f":"J77+J77*Einstellungen!$K$26","v":0},{"$f":"K77+K77*Einstellungen!$K$27","v":0},{"$f":"L77+L77*Einstellungen!$K$28","v":0}]
[{"$nulls":5},{"$f":"F48","v":"Summe"},{"$f":"G48","v":0},{"$f":"SUM(H66:H77)","v":{"v":11000,"d":"11,000"}},{"$f":"SUM(I66:I77)","v":{"v":11220,"d":"11,220"}},{"v":11444.4,"d":"11,444"},{"v":11673.288,"d":"11,673"},{"v":11906.75376,"d":"11,907"},{"v":12144.8888352,"d":"12,145"}]
[]
[{"$nulls":5},"Kosten nach Anlageklassen",{"$f":"G50","v":"Immobilien"},{"$f":"SUMIF($G$66:$G$77,$G$80,H66:H77)","v":{"v":5000,"d":"5,000"}},{"v":5100,"d":"5,100"},{"v":5202,"d":"5,202"},{"v":5306.04,"d":"5,306"},{"v":5412.1608,"d":"5,412"},{"v":5520.4040159999995,"d":"5,520"}]
[{"$nulls":6},"Beteiligungen",{"$f":"SUMIF($G$66:$G$77,$G$81,H66:H77)","v":0},0,0,0,0,0]
[{"$nulls":6},"Wertpapiere",{"$f":"SUM(H83:H86)","v":{"v":6000,"d":"6,000"}},{"v":6120,"d":"6,120"},{"v":6242.4,"d":"6,242"},{"v":6367.248,"d":"6,367"},{"v":6494.59296,"d":"6,495"},{"v":6624.4848192,"d":"6,624"}]
[{"$nulls":6}," davon Aktien",{"$f":"SUMIF($G$66:$G$77,\"Aktien\",H$66:H$77)","v":{"v":6000,"d":"6,000"}},{"$f":"SUMIF($G$66:$G$77,\"Aktien\",I$66:I$77)","v":{"v":6120,"d":"6,120"}},{"v":6242.4,"d":"6,242"},{"$f":"SUMIF($G$66:$G$77,\"Aktien\",K$66:K$77)","v":{"v":6367.248,"d":"6,367"}},{"v":6494.59296,"d":"6,495"},{"v":6624.4848192,"d":"6,624"}]
[{"$nulls":6}," davon Renten",{"$f":"SUMIF($G$66:$G$77,\"Renten\",H$66:H$77)","v":0},{"$f":"SUMIF($G$66:$G$77,\"Renten\",I$66:I$77)","v":0},0,0,0,0]
[{"$nulls":6}," davon Liquidität",{"$f":"SUMIF($G$66:$G$77,\"Liquidität\",H$66:H$77)","v":0},{"$f":"SUMIF($G$66:$G$77,\"Liquidität\",I$66:I$77)","v":0},0,0,0,0]
[{"$nulls":6}," davon Alternative Investments",{"$f":"SUMIF($G$66:$G$77,\"Alternative Investments\",H66:H77)","v":0},0,0,0,0,0]
[{"$nulls":6},"Spar- und Termineinlagen",{"$f":"SUMIF($G$66:$G$77,$G$87,H66:H77)","v":0},0,0,0,0,0]
[{"$nulls":6},"Kontoguthaben Investitionsvermögen",{"$f":"SUMIF($G$66:$G$77,\"Kontoguthaben\",H66:H77)","v":0},0,0,0,0,0]
[{"$nulls":6},"Sonstiges Vermögen",{"$f":"SUMIF($G$66:$G$77,$G$89,H66:H77)","v":0},0,0,0,0,0]
[{"$nulls":6},"Verbindlichkeiten",{"$f":"SUMIF($G$66:$G$77,$G$90,H66:H77)","v":0},0,0,0,0,0]
[{"$nulls":6},"Summe",{"$f":"SUM(H80:H82)+SUM(H87:H90)","v":{"v":11000,"d":"11,000"}},{"v":11220,"d":"11,220"},{"v":11444.4,"d":"11,444"},{"v":11673.288,"d":"11,673"},{"v":11906.75376,"d":"11,907"},{"v":12144.8888352,"d":"12,145"}]
[]
[{"$nulls":5},"Ertragsziel",null,null,{"$f":"Einstellungen!D7","v":2019},{"$f":"I93+1","v":2020},{"$f":"J93+1","v":2021},2022,2023]
[{"$nulls":6},"Zweckerfüllung Überschuss",null,{"$f":"I48+'Einn._Ausg.'!C11-'Einn._Ausg.'!C28-'Daten Projektion'!I78-(I48-I91)*Einstellungen!$D$30%-'Einn._Ausg.'!C8-'Einn._Ausg.'!C9","v":{"v":8677.599999999999,"d":"8,678"}},{"$f":"J48+'Einn._Ausg.'!D11-'Einn._Ausg.'!D28-'Daten Projektion'!J78-(J48-J91)*Einstellungen!$D$30%-'Einn._Ausg.'!D8-'Einn._Ausg.'!D9","v":{"v":9998.914499999999,"d":"9,999"}},{"$f":"K48+'Einn._Ausg.'!E11-'Einn._Ausg.'!E28-'Daten Projektion'!K78-(K48-K91)*Einstellungen!$D$30%-'Einn._Ausg.'!E8-'Einn._Ausg.'!E9","v":{"v":9817.6309775,"d":"9,818"}},{"$f":"L48+'Einn._Ausg.'!F11-'Einn._Ausg.'!F28-'Daten Projektion'!L78-(L48-L91)*Einstellungen!$D$30%-'Einn._Ausg.'!F8-'Einn._Ausg.'!F9","v":{"v":9633.780656737508,"d":"9,634"}},{"$f":"M48+'Einn._Ausg.'!G11-'Einn._Ausg.'!G28-'Daten Projektion'!M78-(M48-M91)*Einstellungen!$D$30%-'Einn._Ausg.'!G8-'Einn._Ausg.'!G9","v":{"v":9447.398218545688,"d":"9,447"}}]
[{"$nulls":6},"Zielsumme",null,{"$f":"Anlageziele!$M$7","v":{"v":10000,"d":"10,000"}},{"$f":"Anlageziele!$M$7","v":{"v":10000,"d":"10,000"}},{"$f":"Anlageziele!$M$7","v":{"v":10000,"d":"10,000"}},{"$f":"Anlageziele!$M$7","v":{"v":10000,"d":"10,000"}},{"$f":"Anlageziele!$M$7","v":{"v":10000,"d":"10,000"}}]
[{"$nulls":6},"Zielquote",null,{"$f":"'Daten VE'!$D$51*Anlageziele!$M$7%","v":{"v":600000000,"d":"600,000,000"}},{"$f":"'Daten VE'!$D$51*Anlageziele!$M$7%","v":{"v":600000000,"d":"600,000,000"}},{"$f":"'Daten VE'!$D$51*Anlageziele!$M$7%","v":{"v":600000000,"d":"600,000,000"}},{"$f":"'Daten VE'!$D$51*Anlageziele!$M$7%","v":{"v":600000000,"d":"600,000,000"}},{"$f":"'Daten VE'!$D$51*Anlageziele!$M$7%","v":{"v":600000000,"d":"600,000,000"}}]
[{"$nulls":6},"Sonstige Ausgaben",null,{"$f":"'Einn._Ausg.'!C28+'Daten Projektion'!I91+('Daten Projektion'!I48-'Daten Projektion'!I78)*Einstellungen!$D$30%","v":{"v":54822.4,"d":"54,822"}},{"$f":"'Einn._Ausg.'!D28+'Daten Projektion'!J91+('Daten Projektion'!J48-'Daten Projektion'!J78)*Einstellungen!$D$30%","v":{"v":54249.8355,"d":"54,250"}},{"$f":"'Einn._Ausg.'!E28+'Daten Projektion'!K91+('Daten Projektion'!K48-'Daten Projektion'!K78)*Einstellungen!$D$30%","v":{"v":55196.30027250001,"d":"55,196"}},{"$f":"'Einn._Ausg.'!F28+'Daten Projektion'!L91+('Daten Projektion'!L48-'Daten Projektion'!L78)*Einstellungen!$D$30%","v":{"v":56162.2158745125,"d":"56,162"}},{"$f":"'Einn._Ausg.'!G28+'Daten Projektion'!M91+('Daten Projektion'!M48-'Daten Projektion'!M78)*Einstellungen!$D$30%","v":{"v":57148.013689110565,"d":"57,148"}}]
[{"$nulls":6},"Ertragsziel Überschuss",null,{"$f":"I94+I97","v":{"v":63500,"d":"63,500"}},{"$f":"J94+J97","v":{"v":64248.75,"d":"64,249"}},{"v":65013.93125000001,"d":"65,014"},{"v":65795.99653125001,"d":"65,796"},{"v":66595.41190765625,"d":"66,595"}]
[{"$nulls":6},"Ertragsziel Zielsumme",null,{"$f":"I95+I97","v":{"v":64822.4,"d":"64,822"}},{"$f":"J95+J97","v":{"v":64249.8355,"d":"64,250"}},{"v":65196.30027250001,"d":"65,196"},{"v":66162.2158745125,"d":"66,162"},{"v":67148.01368911056,"d":"67,148"}]
[{"$nulls":6},"Ertragsziel Zielquote",null,{"$f":"I96+I97","v":{"v":600054822.4,"d":"600,054,822"}},{"$f":"J96+J97","v":{"v":600054249.8355,"d":"600,054,250"}},{"v":600055196.3002725,"d":"600,055,196"},{"v":600056162.2158746,"d":"600,056,162"},{"v":600057148.0136892,"d":"600,057,148"}]
[]
[{"$nulls":5},"Cockpit Grafik Erträge",null,null,{"$f":"I93","v":2019},{"$f":"J93","v":2020},{"$f":"K93","v":2021},{"$f":"L93","v":2022},{"$f":"M93","v":2023}]
[{"$nulls":5},"Ertragsziel",{"$f":"Anlageziele!M5","v":"Zielausschüttung als Betrag"},null,{"$f":"IF(Anlageziele!$M$5=\"Überschuss\",'Daten Projektion'!I98,IF(Anlageziele!$M$5='Daten Einstellg_Ziele'!$D$21,'Daten Projektion'!I99,I100))","v":{"v":64822.4,"d":"64,822"}},{"$f":"IF(Anlageziele!$M$5=\"Überschuss\",'Daten Projektion'!J98,IF(Anlageziele!$M$5='Daten Einstellg_Ziele'!$D$21,'Daten Projektion'!J99,J100))","v":{"v":64249.8355,"d":"64,250"}},{"$f":"IF(Anlageziele!$M$5=\"Überschuss\",'Daten Projektion'!K98,IF(Anlageziele!$M$5='Daten Einstellg_Ziele'!$D$21,'Daten Projektion'!K99,K100))","v":{"v":65196.30027250001,"d":"65,196"}},{"$f":"IF(Anlageziele!$M$5=\"Überschuss\",'Daten Projektion'!L98,IF(Anlageziele!$M$5='Daten Einstellg_Ziele'!$D$21,'Daten Projektion'!L99,L100))","v":{"v":66162.2158745125,"d":"66,162"}},{"$f":"IF(Anlageziele!$M$5=\"Überschuss\",'Daten Projektion'!M98,IF(Anlageziele!$M$5='Daten Einstellg_Ziele'!$D$21,'Daten Projektion'!M99,M100))","v":{"v":67148.01368911056,"d":"67,148"}}]
[{"$nulls":6},"Status quo/Projektion",null,{"$f":"I61","v":{"v":58500,"d":"58,500"}},{"$f":"J61","v":{"v":59248.75,"d":"59,249"}},{"$f":"K61","v":{"v":60013.93125,"d":"60,014"}},{"$f":"L61","v":{"v":60795.996531250006,"d":"60,796"}},{"$f":"M61","v":{"v":61595.41190765626,"d":"61,595"}}]
[]
[{"$nulls":5},"Freie Rücklage","FR Ertragsziel Überschuss",null,{"$f":"('Daten Projektion'!I61-I91)*Einstellungen!$D$30%","v":{"v":15602.400000000001,"d":"15,602"}},{"$f":"('Daten Projektion'!J61-J91)*Einstellungen!$D$30%","v":{"v":15775.4355,"d":"15,775"}},{"$f":"('Daten Projektion'!K61-K91)*Einstellungen!$D$30%","v":{"v":15952.412272500002,"d":"15,952"}},{"$f":"('Daten Projektion'!L61-L91)*Einstellungen!$D$30%","v":{"v":16133.450114512503,"d":"16,133"}},{"$f":"('Daten Projektion'!M61-M91)*Einstellungen!$D$30%","v":{"v":16318.672613910565,"d":"16,319"}}]
[{"$nulls":6},"Einnahmen",null,{"$f":"'Zahlen Basis'!F31","v":{"v":63500,"d":"63,500"}},{"$f":"'Zahlen Basis'!G31","v":{"v":64248.75,"d":"64,249"}},{"$f":"'Zahlen Basis'!H31","v":{"v":65013.93125,"d":"65,014"}},{"$f":"'Zahlen Basis'!I31","v":{"v":65795.99653125,"d":"65,796"}},{"$f":"'Zahlen Basis'!J31","v":{"v":66595.41190765626,"d":"66,595"}}]
[{"$nulls":6},"Zielausschüttung Ausgaben o. FR",null,{"$f":"SUM('Zahlen Basis'!F40:F42)+'Zahlen Basis'!F46+'Zahlen Basis'!F47+'Zahlen Basis'!F48+'Zahlen Basis'!F50","v":{"v":52220,"d":"52,220"}},{"$f":"SUM('Zahlen Basis'!G40:G42)+'Zahlen Basis'!G46+'Zahlen Basis'!G47+'Zahlen Basis'!G48+'Zahlen Basis'!G50","v":{"v":51534.4,"d":"51,534"}},{"$f":"SUM('Zahlen Basis'!H40:H42)+'Zahlen Basis'!H46+'Zahlen Basis'!H47+'Zahlen Basis'!H48+'Zahlen Basis'!H50","v":{"v":52365.088,"d":"52,365"}},{"$f":"SUM('Zahlen Basis'!I40:I42)+'Zahlen Basis'!I46+'Zahlen Basis'!I47+'Zahlen Basis'!I48+'Zahlen Basis'!I50","v":{"v":53212.389760000005,"d":"53,212"}},{"$f":"SUM('Zahlen Basis'!J40:J42)+'Zahlen Basis'!J46+'Zahlen Basis'!J47+'Zahlen Basis'!J48+'Zahlen Basis'!J50","v":{"v":54076.637555199995,"d":"54,077"}}]
[{"$nulls":6},"Differenz",null,{"$f":"I107-I108","v":{"v":11280,"d":"11,280"}},{"$f":"J107-J108","v":{"v":12714.349999999999,"d":"12,714"}},{"v":12648.843249999998,"d":"12,649"},{"v":12583.606771249993,"d":"12,584"},{"v":12518.774352456268,"d":"12,519"}]
[{"$nulls":6},"FR Zielausschüttung",null,{"$f":"IF(I109>I106,I106,I109)","v":{"v":11280,"d":"11,280"}},{"$f":"IF(J109>J106,J106,J109)","v":{"v":12714.349999999999,"d":"12,714"}},{"v":12648.843249999998,"d":"12,649"},{"v":12583.606771249993,"d":"12,584"},{"v":12518.774352456268,"d":"12,519"}]
[]
[{"$nulls":5},"Risiko: Vermögen Worst Case Basiszenario"]
[]
[{"$nulls":4},{"$f":"E5","v":"Nr."},"Vermögensgegenstand","Anlageklasse","Wert EUR",2019,2020,2021,2022,2023]
[{"$nulls":4},{"$f":"E6","v":1},"Vermögensverwaltung A-Bank Aktien","Aktien",{"v":650000,"d":"650,000"},{"$f":"IF(I$114>=Annahmen!$L7,0,IF(I$114=Annahmen!$K7,'Daten Projektion'!H115+'Daten Projektion'!H115*Annahmen!$I7,'Daten Projektion'!H115+'Daten Projektion'!H115*Annahmen!$D7))","v":{"v":669500,"d":"669,500"}},{"$f":"IF(J114>=Annahmen!$L$7,0,IF(J114=Annahmen!$K$7,'Daten Projektion'!I115+'Daten Projektion'!I115*Annahmen!$I$7,'Daten Projektion'!I115+'Daten Projektion'!I115*Annahmen!$D$7))","v":{"v":468650,"d":"468,650"}},{"$f":"IF(K114>=Annahmen!$L$7,0,IF(K114=Annahmen!$K$7,'Daten Projektion'!J115+'Daten Projektion'!J115*Annahmen!$I$7,'Daten Projektion'!J115+'Daten Projektion'!J115*Annahmen!$D$7))","v":{"v":482709.5,"d":"482,710"}},{"$f":"IF(L114>=Annahmen!$L$7,0,IF(L114=Annahmen!$K$7,'Daten Projektion'!K115+'Daten Projektion'!K115*Annahmen!$I$7,'Daten Projektion'!K115+'Daten Projektion'!K115*Annahmen!$D$7))","v":{"v":497190.785,"d":"497,191"}},{"$f":"IF(M114>=Annahmen!$L$7,0,IF(M114=Annahmen!$K$7,'Daten Projektion'!L115+'Daten Projektion'!L115*Annahmen!$I$7,'Daten Projektion'!L115+'Daten Projektion'!L115*Annahmen!$D$7))","v":{"v":512106.50854999997,"d":"512,107"}}]
[{"$nulls":4},2,"Vermögensverwaltung A-Bank Renten","Renten",{"v":5200000,"d":"5,200,000"},{"$f":"IF(I$114>=Annahmen!$L8,0,IF(I$114=Annahmen!$K8,'Daten Projektion'!H116+'Daten Projektion'!H116*Annahmen!$I8,'Daten Projektion'!H116+'Daten Projektion'!H116*Annahmen!$D8))","v":{"v":5226000,"d":"5,226,000"}},{"$f":"IF(J$114>=Annahmen!$L8,0,IF(J$114=Annahmen!$K8,'Daten Projektion'!I116+'Daten Projektion'!I116*Annahmen!$I8,'Daten Projektion'!I116+'Daten Projektion'!I116*Annahmen!$D8))","v":{"v":4703400,"d":"4,703,400"}},{"$f":"IF(K$114>=Annahmen!$L8,0,IF(K$114=Annahmen!$K8,'Daten Projektion'!J116+'Daten Projektion'!J116*Annahmen!$I8,'Daten Projektion'!J116+'Daten Projektion'!J116*Annahmen!$D8))","v":{"v":4726917,"d":"4,726,917"}},{"$f":"IF(L$114>=Annahmen!$L8,0,IF(L$114=Annahmen!$K8,'Daten Projektion'!K116+'Daten Projektion'!K116*Annahmen!$I8,'Daten Projektion'!K116+'Daten Projektion'!K116*Annahmen!$D8))","v":{"v":4750551.585,"d":"4,750,552"}},{"$f":"IF(M$114>=Annahmen!$L8,0,IF(M$114=Annahmen!$K8,'Daten Projektion'!L116+'Daten Projektion'!L116*Annahmen!$I8,'Daten Projektion'!L116+'Daten Projektion'!L116*Annahmen!$D8))","v":{"v":4774304.342925,"d":"4,774,304"}}]
[{"$nulls":4},3,"Stiftungsfonds Xy","Renten",{"v":250000,"d":"250,000"},{"$f":"IF(I$114>=Annahmen!$L9,0,IF(I$114=Annahmen!$K9,'Daten Projektion'!H117+'Daten Projektion'!H117*Annahmen!$I9,'Daten Projektion'!H117+'Daten Projektion'!H117*Annahmen!$D9))","v":{"v":251250,"d":"251,250"}},{"$f":"IF(J$114>=Annahmen!$L9,0,IF(J$114=Annahmen!$K9,'Daten Projektion'!I117+'Daten Projektion'!I117*Annahmen!$I9,'Daten Projektion'!I117+'Daten Projektion'!I117*Annahmen!$D9))","v":{"v":251250,"d":"251,250"}},{"$f":"IF(K$114>=Annahmen!$L9,0,IF(K$114=Annahmen!$K9,'Daten Projektion'!J117+'Daten Projektion'!J117*Annahmen!$I9,'Daten Projektion'!J117+'Daten Projektion'!J117*Annahmen!$D9))","v":{"v":252506.25,"d":"252,506"}},{"$f":"IF(L$114>=Annahmen!$L9,0,IF(L$114=Annahmen!$K9,'Daten Projektion'!K117+'Daten Projektion'!K117*Annahmen!$I9,'Daten Projektion'!K117+'Daten Projektion'!K117*Annahmen!$D9))","v":{"v":253768.78125,"d":"253,769"}},{"$f":"IF(M$114>=Annahmen!$L9,0,IF(M$114=Annahmen!$K9,'Daten Projektion'!L117+'Daten Projektion'!L117*Annahmen!$I9,'Daten Projektion'!L117+'Daten Projektion'!L117*Annahmen!$D9))","v":{"v":255037.62515625,"d":"255,038"}}]
[{"$nulls":4},4,"Immobilie","Immobilien",{"v":500000,"d":"500,000"},{"$f":"IF(I$114>=Annahmen!$L10,0,IF(I$114=Annahmen!$K10,'Daten Projektion'!H118+'Daten Projektion'!H118*Annahmen!$I10,'Daten Projektion'!H118+'Daten Projektion'!H118*Annahmen!$D10))","v":{"v":505000,"d":"505,000"}},{"$f":"IF(J$114>=Annahmen!$L10,0,IF(J$114=Annahmen!$K10,'Daten Projektion'!I118+'Daten Projektion'!I118*Annahmen!$I10,'Daten Projektion'!I118+'Daten Projektion'!I118*Annahmen!$D10))","v":{"v":505000,"d":"505,000"}},{"$f":"IF(K$114>=Annahmen!$L10,0,IF(K$114=Annahmen!$K10,'Daten Projektion'!J118+'Daten Projektion'!J118*Annahmen!$I10,'Daten Projektion'!J118+'Daten Projektion'!J118*Annahmen!$D10))","v":{"v":510050,"d":"510,050"}},{"$f":"IF(L$114>=Annahmen!$L10,0,IF(L$114=Annahmen!$K10,'Daten Projektion'!K118+'Daten Projektion'!K118*Annahmen!$I10,'Daten Projektion'!K118+'Daten Projektion'!K118*Annahmen!$D10))","v":{"v":515150.5,"d":"515,151"}},{"$f":"IF(M$114>=Annahmen!$L10,0,IF(M$114=Annahmen!$K10,'Daten Projektion'!L118+'Daten Projektion'!L118*Annahmen!$I10,'Daten Projektion'!L118+'Daten Projektion'!L118*Annahmen!$D10))","v":{"v":520302.005,"d":"520,302"}}]
[{"$nulls":4},5,"Bankguthaben B-Bank","Kontoguthaben",{"v":1000000,"d":"1,000,000"},{"$f":"IF(I$114>=Annahmen!$L11,0,IF(I$114=Annahmen!$K11,'Daten Projektion'!H119+'Daten Projektion'!H119*Annahmen!$I11,'Daten Projektion'!H119+'Daten Projektion'!H119*Annahmen!$D11))","v":{"v":1000000,"d":"1,000,000"}},{"$f":"IF(J$114>=Annahmen!$L11,0,IF(J$114=Annahmen!$K11,'Daten Projektion'!I119+'Daten Projektion'!I119*Annahmen!$I11,'Daten Projektion'!I119+'Daten Projektion'!I119*Annahmen!$D11))","v":{"v":1000000,"d":"1,000,000"}},{"$f":"IF(K$114>=Annahmen!$L11,0,IF(K$114=Annahmen!$K11,'Daten Projektion'!J119+'Daten Projektion'!J119*Annahmen!$I11,'Daten Projektion'!J119+'Daten Projektion'!J119*Annahmen!$D11))","v":{"v":1000000,"d":"1,000,000"}},{"$f":"IF(L$114>=Annahmen!$L11,0,IF(L$114=Annahmen!$K11,'Daten Projektion'!K119+'Daten Projektion'!K119*Annahmen!$I11,'Daten Projektion'!K119+'Daten Projektion'!K119*Annahmen!$D11))","v":{"v":1000000,"d":"1,000,000"}},{"$f":"IF(M$114>=Annahmen!$L11,0,IF(M$114=Annahmen!$K11,'Daten Projektion'!L119+'Daten Projektion'!L119*Annahmen!$I11,'Daten Projektion'!L119+'Daten Projektion'!L119*Annahmen!$D11))","v":{"v":1000000,"d":"1,000,000"}}]
[{"$nulls":4},6,0,"Bitte auswählen",0,{"$f":"IF(I$114>=Annahmen!$L12,0,IF(I$114=Annahmen!$K12,'Daten Projektion'!H120+'Daten Projektion'!H120*Annahmen!$I12,'Daten Projektion'!H120+'Daten Projektion'!H120*Annahmen!$D12))","v":0},{"$f":"IF(J$114>=Annahmen!$L12,0,IF(J$114=Annahmen!$K12,'Daten Projektion'!I120+'Daten Projektion'!I120*Annahmen!$I12,'Daten Projektion'!I120+'Daten Projektion'!I120*Annahmen!$D12))","v":0},{"$f":"IF(K$114>=Annahmen!$L12,0,IF(K$114=Annahmen!$K12,'Daten Projektion'!J120+'Daten Projektion'!J120*Annahmen!$I12,'Daten Projektion'!J120+'Daten Projektion'!J120*Annahmen!$D12))","v":0},{"$f":"IF(L$114>=Annahmen!$L12,0,IF(L$114=Annahmen!$K12,'Daten Projektion'!K120+'Daten Projektion'!K120*Annahmen!$I12,'Daten Projektion'!K120+'Daten Projektion'!K120*Annahmen!$D12))","v":0},{"$f":"IF(M$114>=Annahmen!$L12,0,IF(M$114=Annahmen!$K12,'Daten Projektion'!L120+'Daten Projektion'!L120*Annahmen!$I12,'Daten Projektion'!L120+'Daten Projektion'!L120*Annahmen!$D12))","v":0}]
[{"$nulls":4},7,0,"Bitte auswählen",0,{"$f":"IF(I$114>=Annahmen!$L13,0,IF(I$114=Annahmen!$K13,'Daten Projektion'!H121+'Daten Projektion'!H121*Annahmen!$I13,'Daten Projektion'!H121+'Daten Projektion'!H121*Annahmen!$D13))","v":0},{"$f":"IF(J$114>=Annahmen!$L13,0,IF(J$114=Annahmen!$K13,'Daten Projektion'!I121+'Daten Projektion'!I121*Annahmen!$I13,'Daten Projektion'!I121+'Daten Projektion'!I121*Annahmen!$D13))","v":0},{"$f":"IF(K$114>=Annahmen!$L13,0,IF(K$114=Annahmen!$K13,'Daten Projektion'!J121+'Daten Projektion'!J121*Annahmen!$I13,'Daten Projektion'!J121+'Daten Projektion'!J121*Annahmen!$D13))","v":0},{"$f":"IF(L$114>=Annahmen!$L13,0,IF(L$114=Annahmen!$K13,'Daten Projektion'!K121+'Daten Projektion'!K121*Annahmen!$I13,'Daten Projektion'!K121+'Daten Projektion'!K121*Annahmen!$D13))","v":0},{"$f":"IF(M$114>=Annahmen!$L13,0,IF(M$114=Annahmen!$K13,'Daten Projektion'!L121+'Daten Projektion'!L121*Annahmen!$I13,'Daten Projektion'!L121+'Daten Projektion'!L121*Annahmen!$D13))","v":0}]
[{"$nulls":4},8,0,"Bitte auswählen",0,{"$f":"IF(I$114>=Annahmen!$L14,0,IF(I$114=Annahmen!$K14,'Daten Projektion'!H122+'Daten Projektion'!H122*Annahmen!$I14,'Daten Projektion'!H122+'Daten Projektion'!H122*Annahmen!$D14))","v":0},{"$f":"IF(J$114>=Annahmen!$L14,0,IF(J$114=Annahmen!$K14,'Daten Projektion'!I122+'Daten Projektion'!I122*Annahmen!$I14,'Daten Projektion'!I122+'Daten Projektion'!I122*Annahmen!$D14))","v":0},{"$f":"IF(K$114>=Annahmen!$L14,0,IF(K$114=Annahmen!$K14,'Daten Projektion'!J122+'Daten Projektion'!J122*Annahmen!$I14,'Daten Projektion'!J122+'Daten Projektion'!J122*Annahmen!$D14))","v":0},{"$f":"IF(L$114>=Annahmen!$L14,0,IF(L$114=Annahmen!$K14,'Daten Projektion'!K122+'Daten Projektion'!K122*Annahmen!$I14,'Daten Projektion'!K122+'Daten Projektion'!K122*Annahmen!$D14))","v":0},{"$f":"IF(M$114>=Annahmen!$L14,0,IF(M$114=Annahmen!$K14,'Daten Projektion'!L122+'Daten Projektion'!L122*Annahmen!$I14,'Daten Projektion'!L122+'Daten Projektion'!L122*Annahmen!$D14))","v":0}]
[{"$nulls":4},9,0,"Bitte auswählen",0,{"$f":"IF(I$114>=Annahmen!$L15,0,IF(I$114=Annahmen!$K15,'Daten Projektion'!H123+'Daten Projektion'!H123*Annahmen!$I15,'Daten Projektion'!H123+'Daten Projektion'!H123*Annahmen!$D15))","v":0},{"$f":"IF(J$114>=Annahmen!$L15,0,IF(J$114=Annahmen!$K15,'Daten Projektion'!I123+'Daten Projektion'!I123*Annahmen!$I15,'Daten Projektion'!I123+'Daten Projektion'!I123*Annahmen!$D15))","v":0},{"$f":"IF(K$114>=Annahmen!$L15,0,IF(K$114=Annahmen!$K15,'Daten Projektion'!J123+'Daten Projektion'!J123*Annahmen!$I15,'Daten Projektion'!J123+'Daten Projektion'!J123*Annahmen!$D15))","v":0},{"$f":"IF(L$114>=Annahmen!$L15,0,IF(L$114=Annahmen!$K15,'Daten Projektion'!K123+'Daten Projektion'!K123*Annahmen!$I15,'Daten Projektion'!K123+'Daten Projektion'!K123*Annahmen!$D15))","v":0},{"$f":"IF(M$114>=Annahmen!$L15,0,IF(M$114=Annahmen!$K15,'Daten Projektion'!L123+'Daten Projektion'!L123*Annahmen!$I15,'Daten Projektion'!L123+'Daten Projektion'!L123*Annahmen!$D15))","v":0}]
[{"$nulls":4},10,0,"Bitte auswählen",0,{"$f":"IF(I$114>=Annahmen!$L16,0,IF(I$114=Annahmen!$K16,'Daten Projektion'!H124+'Daten Projektion'!H124*Annahmen!$I16,'Daten Projektion'!H124+'Daten Projektion'!H124*Annahmen!$D16))","v":0},{"$f":"IF(J$114>=Annahmen!$L16,0,IF(J$114=Annahmen!$K16,'Daten Projektion'!I124+'Daten Projektion'!I124*Annahmen!$I16,'Daten Projektion'!I124+'Daten Projektion'!I124*Annahmen!$D16))","v":0},{"$f":"IF(K$114>=Annahmen!$L16,0,IF(K$114=Annahmen!$K16,'Daten Projektion'!J124+'Daten Projektion'!J124*Annahmen!$I16,'Daten Projektion'!J124+'Daten Projektion'!J124*Annahmen!$D16))","v":0},{"$f":"IF(L$114>=Annahmen!$L16,0,IF(L$114=Annahmen!$K16,'Daten Projektion'!K124+'Daten Projektion'!K124*Annahmen!$I16,'Daten Projektion'!K124+'Daten Projektion'!K124*Annahmen!$D16))","v":0},{"$f":"IF(M$114>=Annahmen!$L16,0,IF(M$114=Annahmen!$K16,'Daten Projektion'!L124+'Daten Projektion'!L124*Annahmen!$I16,'Daten Projektion'!L124+'Daten Projektion'!L124*Annahmen!$D16))","v":0}]
[{"$nulls":4},11,0,"Bitte auswählen",0,{"$f":"IF(I$114>=Annahmen!$L17,0,IF(I$114=Annahmen!$K17,'Daten Projektion'!H125+'Daten Projektion'!H125*Annahmen!$I17,'Daten Projektion'!H125+'Daten Projektion'!H125*Annahmen!$D17))","v":0},{"$f":"IF(J$114>=Annahmen!$L17,0,IF(J$114=Annahmen!$K17,'Daten Projektion'!I125+'Daten Projektion'!I125*Annahmen!$I17,'Daten Projektion'!I125+'Daten Projektion'!I125*Annahmen!$D17))","v":0},{"$f":"IF(K$114>=Annahmen!$L17,0,IF(K$114=Annahmen!$K17,'Daten Projektion'!J125+'Daten Projektion'!J125*Annahmen!$I17,'Daten Projektion'!J125+'Daten Projektion'!J125*Annahmen!$D17))","v":0},{"$f":"IF(L$114>=Annahmen!$L17,0,IF(L$114=Annahmen!$K17,'Daten Projektion'!K125+'Daten Projektion'!K125*Annahmen!$I17,'Daten Projektion'!K125+'Daten Projektion'!K125*Annahmen!$D17))","v":0},{"$f":"IF(M$114>=Annahmen!$L17,0,IF(M$114=Annahmen!$K17,'Daten Projektion'!L125+'Daten Projektion'!L125*Annahmen!$I17,'Daten Projektion'!L125+'Daten Projektion'!L125*Annahmen!$D17))","v":0}]
[{"$nulls":4},12,0,"Bitte auswählen",0,{"$f":"IF(I$114>=Annahmen!$L18,0,IF(I$114=Annahmen!$K18,'Daten Projektion'!H126+'Daten Projektion'!H126*Annahmen!$I18,'Daten Projektion'!H126+'Daten Projektion'!H126*Annahmen!$D18))","v":0},{"$f":"IF(J$114>=Annahmen!$L18,0,IF(J$114=Annahmen!$K18,'Daten Projektion'!I126+'Daten Projektion'!I126*Annahmen!$I18,'Daten Projektion'!I126+'Daten Projektion'!I126*Annahmen!$D18))","v":0},{"$f":"IF(K$114>=Annahmen!$L18,0,IF(K$114=Annahmen!$K18,'Daten Projektion'!J126+'Daten Projektion'!J126*Annahmen!$I18,'Daten Projektion'!J126+'Daten Projektion'!J126*Annahmen!$D18))","v":0},{"$f":"IF(L$114>=Annahmen!$L18,0,IF(L$114=Annahmen!$K18,'Daten Projektion'!K126+'Daten Projektion'!K126*Annahmen!$I18,'Daten Projektion'!K126+'Daten Projektion'!K126*Annahmen!$D18))","v":0},{"$f":"IF(M$114>=Annahmen!$L18,0,IF(M$114=Annahmen!$K18,'Daten Projektion'!L126+'Daten Projektion'!L126*Annahmen!$I18,'Daten Projektion'!L126+'Daten Projektion'!L126*Annahmen!$D18))","v":0}]
[{"$nulls":5},"Summe",null,{"$f":"SUM(H115:H126)","v":{"v":7600000,"d":"7,600,000"}},{"$f":"SUM(I115:I126)","v":{"v":7651750,"d":"7,651,750"}},{"v":6928300,"d":"6,928,300"},{"v":6972182.75,"d":"6,972,183"},{"v":7016661.65125,"d":"7,016,662"},{"v":7061750.48163125,"d":"7,061,750"}]
[]
[{"$nulls":5},"Vermögen Worst Case nach AK","Immobilien",{"$f":"SUMIF($G115:$G126,G129,H115:H126)","v":{"v":500000,"d":"500,000"}},{"$f":"SUMIF($G$115:$G$126,$G$129,I$115:$I126)","v":{"v":505000,"d":"505,000"}},{"$f":"SUMIF($G$115:$G$126,$G$129,$J$115:J126)","v":{"v":505000,"d":"505,000"}},{"$f":"SUMIF($G$115:$G$126,$G$129,$K$115:K126)","v":{"v":510050,"d":"510,050"}},{"$f":"SUMIF($G$115:$G$126,$G$129,$L$115:L126)","v":{"v":515150.5,"d":"515,151"}},{"$f":"SUMIF($G$115:$G$126,$G$129,$M$115:M126)","v":{"v":520302.005,"d":"520,302"}}]
[{"$nulls":6},"Beteiligungen",{"$f":"SUMIF($G115:$G126,G130,H115:H126)","v":0},{"$f":"SUMIF($G115:$G126,H130,I115:I126)","v":0},0,0,0,0]
[{"$nulls":6},"Wertpapiere",{"$f":"SUM(H132:H135)","v":{"v":6100000,"d":"6,100,000"}},{"v":6146750,"d":"6,146,750"},{"v":5423300,"d":"5,423,300"},{"v":5462132.75,"d":"5,462,133"},{"v":5501511.15125,"d":"5,501,511"},{"v":5541448.47663125,"d":"5,541,448"}]
[{"$nulls":6}," davon Aktien",{"$f":"SUMIF($G$115:$G$126,\"Aktien\",$H$115:$H$126)","v":{"v":650000,"d":"650,000"}},{"$f":"SUMIF($G$115:$G$126,\"Aktien\",I$115:I$126)","v":{"v":669500,"d":"669,500"}},{"$f":"SUMIF($G$115:$G$126,\"Aktien\",J$115:J$126)","v":{"v":468650,"d":"468,650"}},{"v":482709.5,"d":"482,710"},{"v":497190.785,"d":"497,191"},{"v":512106.50854999997,"d":"512,107"}]
[{"$nulls":6}," davon Renten",{"$f":"SUMIF($G$115:$G$126,\"Renten\",H$115:H$126)","v":{"v":5450000,"d":"5,450,000"}},{"$f":"SUMIF($G$115:$G$126,\"Renten\",I$115:I$126)","v":{"v":5477250,"d":"5,477,250"}},{"v":4954650,"d":"4,954,650"},{"v":4979423.25,"d":"4,979,423"},{"v":5004320.36625,"d":"5,004,320"},{"v":5029341.96808125,"d":"5,029,342"}]
[{"$nulls":6}," davon Liquidität",{"$f":"SUMIF($G$115:$G$126,\"Liquididtät\",H115:H126)","v":0},{"$f":"SUMIF($G$115:$G$126,\"Liquididtät\",I115:I126)","v":0},0,0,0,0]
[{"$nulls":6}," davon Alternative Investments",{"$f":"SUMIF($G$115:$G$126,\"Alternative Investments\",H115:H126)","v":0},{"$f":"SUMIF($G$115:$G$126,\"Alternative Investments\",I115:I126)","v":0},0,0,0,0]
[{"$nulls":6},"Spar- und Termineinlagen",{"$f":"SUMIF($G$115:$G$126,\"Spar- u. Termineinlagen\",H115:H126)","v":0},{"$f":"SUMIF($G$115:$G$126,\"Spar- u. Termineinlagen\",I115:I126)","v":0},0,0,0,0]
[{"$nulls":6},"Kontoguthaben Investitionsvermögen",{"$f":"SUMIF($G$6:$G$17,\"Kontoguthaben\",H115:H126)","v":{"v":1000000,"d":"1,000,000"}},{"$f":"SUMIF($G$6:$G$17,\"Kontoguthaben\",I115:I126)","v":{"v":1000000,"d":"1,000,000"}},{"v":1000000,"d":"1,000,000"},{"v":1000000,"d":"1,000,000"},{"v":1000000,"d":"1,000,000"},{"v":1000000,"d":"1,000,000"}]
[{"$nulls":6},"Sonstiges Vermögen",{"$f":"SUMIF($G$115:$G$126,\"Sonstiges Vermögen\",H115:H126)","v":0},{"$f":"SUMIF($G$115:$G$126,\"Sonstiges Vermögen\",I115:I126)","v":0},0,0,0,0]
[{"$nulls":6},"Verbindlichkeiten",{"$f":"SUMIF($G$115:$G$126,\"Verbindlichkeiten\",H115:H126)","v":0},{"$f":"SUMIF($G$115:$G$126,\"Verbindlichkeiten\",I115:I126)","v":0},0,0,0,0]
[{"$nulls":6},"Summe",{"$f":"SUM(H129:H131)+SUM(H136:H139)","v":{"v":7600000,"d":"7,600,000"}},{"v":7651750,"d":"7,651,750"},{"v":6928300,"d":"6,928,300"},{"v":6972182.75,"d":"6,972,183"},{"v":7016661.65125,"d":"7,016,662"},{"v":7061750.48163125,"d":"7,061,750"}]
[]
[{"$nulls":8},{"$f":"I114","v":2019},{"$f":"J114","v":2020},2021,2022,2023]
[{"$nulls":5},"Cockpit Grafik Risiko","Maximalverlust Projektion",null,{"$f":"I140","v":{"v":7651750,"d":"7,651,750"}},{"$f":"J140","v":{"v":6928300,"d":"6,928,300"}},{"v":6972182.75,"d":"6,972,183"},{"v":7016661.65125,"d":"7,016,662"},{"v":7061750.48163125,"d":"7,061,750"}]
[{"$nulls":6},"Risikoziel Investitionsvermögen",null,{"$f":"'Daten VE'!I45-'Daten VE'!I45*Anlageziele!$E$21","v":{"v":7341074.63813493,"d":"7,341,075"}},{"$f":"'Daten VE'!J45-'Daten VE'!J45*Anlageziele!$E$21","v":{"v":7487896.130897629,"d":"7,487,896"}},{"$f":"'Daten VE'!K45-'Daten VE'!K45*Anlageziele!$E$21","v":{"v":7637654.053515582,"d":"7,637,654"}},{"$f":"'Daten VE'!L45-'Daten VE'!L45*Anlageziele!$E$21","v":{"v":7790407.134585894,"d":"7,790,407"}},{"$f":"'Daten VE'!M45-'Daten VE'!M45*Anlageziele!$E$21","v":{"v":7946215.277277612,"d":"7,946,215"}}]
[{"$nulls":6},"Risikoziel Grundstock",null,{"$f":"'Daten VE'!I39-'Daten VE'!I39*Anlageziele!E19","v":{"v":6000000,"d":"6,000,000"}},{"$f":"'Daten VE'!J39-'Daten VE'!J39*Anlageziele!F19","v":{"v":6000000,"d":"6,000,000"}},{"$f":"'Daten VE'!K39-'Daten VE'!K39*Anlageziele!G19","v":{"v":6000000,"d":"6,000,000"}},{"$f":"'Daten VE'!L39-'Daten VE'!L39*Anlageziele!H19","v":{"v":6000000,"d":"6,000,000"}},{"$f":"'Daten VE'!M39-'Daten VE'!M39*Anlageziele!I19","v":{"v":6000000,"d":"6,000,000"}}]
[]
[{"$nulls":5},"Nachhaltigkeit"]
[]
[null,null,"Nachhaltigkeit",null,{"$f":"Vermentw.!B4","v":"Nr."},{"$f":"Vermentw.!C4","v":"Vermögensgegenstand (Bezeichnung)"},{"$f":"Vermentw.!H4","v":"Nachhaltigkeit"},{"$f":"Vermentw.!D4","v":"Wert EUR"},{"$f":"I142","v":2019},{"$f":"J142","v":2020},{"$f":"K142","v":2021},{"$f":"L142","v":2022},{"$f":"M142","v":2023}]
[{"$nulls":4},{"$f":"Vermentw.!B5","v":1},{"$f":"Vermentw.!C5","v":"Vermögensverwaltung A-Bank Aktien"},{"$f":"Vermentw.!H5","v":"Engagement"},{"$f":"H6","v":{"v":650000,"d":"650,000"}},{"v":669500,"d":"669,500"},{"v":689585,"d":"689,585"},{"v":710272.55,"d":"710,273"},{"v":731580.7265000001,"d":"731,581"},{"v":753528.1482950001,"d":"753,528"}]
[{"$nulls":4},{"$f":"Vermentw.!B6","v":2},{"$f":"Vermentw.!C6","v":"Vermögensverwaltung A-Bank Renten"},{"$f":"Vermentw.!H6","v":"Best in Class"},{"v":5200000,"d":"5,200,000"},{"v":5226000,"d":"5,226,000"},{"v":5252130,"d":"5,252,130"},{"v":5278390.65,"d":"5,278,391"},{"v":5304782.603250001,"d":"5,304,783"},{"v":5331306.516266251,"d":"5,331,307"}]
[{"$nulls":4},{"$f":"Vermentw.!B7","v":3},{"$f":"Vermentw.!C7","v":"Stiftungsfonds Xy"},{"$f":"Vermentw.!H7","v":"Ausschluss"},{"v":250000,"d":"250,000"},{"v":251250,"d":"251,250"},{"v":252506.25,"d":"252,506"},{"v":253768.78125,"d":"253,769"},{"v":255037.62515625,"d":"255,038"},{"v":256312.81328203125,"d":"256,313"}]
[{"$nulls":4},{"$f":"Vermentw.!B8","v":4},{"$f":"Vermentw.!C8","v":"Immobilie"},{"$f":"Vermentw.!H8","v":"Zweckkonform"},{"v":500000,"d":"500,000"},{"v":505000,"d":"505,000"},{"v":510050,"d":"510,050"},{"v":515150.5,"d":"515,151"},{"v":520302.005,"d":"520,302"},{"v":525505.02505,"d":"525,505"}]
[{"$nulls":4},{"$f":"Vermentw.!B9","v":5},{"$f":"Vermentw.!C9","v":"Bankguthaben B-Bank"},{"$f":"Vermentw.!H9","v":"Keine"},{"v":1000000,"d":"1,000,000"},{"v":1000000,"d":"1,000,000"},{"v":1000000,"d":"1,000,000"},{"v":1000000,"d":"1,000,000"},{"v":1000000,"d":"1,000,000"},{"v":1000000,"d":"1,000,000"}]
[{"$nulls":4},{"$f":"Vermentw.!B10","v":6},{"$f":"Vermentw.!C10","v":0},{"$f":"Vermentw.!H10","v":"Bitte ausw."},0,0,0,0,0,0]
[{"$nulls":4},{"$f":"Vermentw.!B11","v":7},{"$f":"Vermentw.!C11","v":0},{"$f":"Vermentw.!H11","v":"Bitte ausw."},0,0,0,0,0,0]
[{"$nulls":4},{"$f":"Vermentw.!B12","v":8},{"$f":"Vermentw.!C12","v":0},{"$f":"Vermentw.!H12","v":"Bitte ausw."},0,0,0,0,0,0]
[{"$nulls":4},{"$f":"Vermentw.!B13","v":9},{"$f":"Vermentw.!C13","v":0},{"$f":"Vermentw.!H13","v":"Bitte ausw."},0,0,0,0,0,0]
[{"$nulls":4},{"$f":"Vermentw.!B14","v":10},{"$f":"Vermentw.!C14","v":0},{"$f":"Vermentw.!H14","v":"Bitte ausw."},0,0,0,0,0,0]
[{"$nulls":4},{"$f":"Vermentw.!B15","v":11},{"$f":"Vermentw.!C15","v":0},{"$f":"Vermentw.!H15","v":"Bitte ausw."},0,0,0,0,0,0]
[{"$nulls":4},{"$f":"Vermentw.!B16","v":12},{"$f":"Vermentw.!C16","v":0},{"$f":"Vermentw.!H16","v":"Bitte ausw."},0,0,0,0,0,0]
[{"$nulls":5},"Summe",null,{"$f":"SUM(H150:H161)","v":{"v":7600000,"d":"7,600,000"}},{"$f":"SUM(I150:I161)","v":{"v":7651750,"d":"7,651,750"}},{"v":7704271.25,"d":"7,704,271"},{"v":7757582.48125,"d":"7,757,582"},{"v":7811702.95990625,"d":"7,811,703"},{"v":7866652.502893283,"d":"7,866,653"}]
[]
[{"$nulls":5},"Vermögen nach Nachhaltigkeit",null,null,{"$f":"I149","v":2019},{"$f":"J149","v":2020},2021,2022,2023]
[{"$nulls":6},"Ausschluss",{"$f":"SUMIF($G$150:$G$161,$G165,$H$150:$H$161)","v":{"v":250000,"d":"250,000"}},{"$f":"SUMIF($G$150:$G$161,$G$165,I150:I161)","v":{"v":251250,"d":"251,250"}},{"$f":"SUMIF($G$150:$G$161,$G$165,J150:J161)","v":{"v":252506.25,"d":"252,506"}},{"$f":"SUMIF($G$150:$G$161,$G$165,K150:K161)","v":{"v":253768.78125,"d":"253,769"}},{"$f":"SUMIF($G$150:$G$161,$G$165,L150:L161)","v":{"v":255037.62515625,"d":"255,038"}},{"$f":"SUMIF($G$150:$G$161,$G$165,M150:M161)","v":{"v":256312.81328203125,"d":"256,313"}}]
[{"$nulls":6},"Zweckkonform",{"$f":"SUMIF($G$150:$G$161,$G166,H$150:H$161)","v":{"v":500000,"d":"500,000"}},{"$f":"SUMIF($G$150:$G$161,$G166,I$150:I$161)","v":{"v":505000,"d":"505,000"}},{"v":510050,"d":"510,050"},{"v":515150.5,"d":"515,151"},{"v":520302.005,"d":"520,302"},{"v":525505.02505,"d":"525,505"}]
[{"$nulls":6},"Best in Class",{"$f":"SUMIF($G$150:$G$161,$G167,H$150:H$161)","v":{"v":5200000,"d":"5,200,000"}},{"v":5226000,"d":"5,226,000"},{"v":5252130,"d":"5,252,130"},{"v":5278390.65,"d":"5,278,391"},{"v":5304782.603250001,"d":"5,304,783"},{"v":5331306.516266251,"d":"5,331,307"}]
[{"$nulls":6},"Engagement",{"$f":"SUMIF($G$150:$G$161,$G168,H$150:H$161)","v":{"v":650000,"d":"650,000"}},{"v":669500,"d":"669,500"},{"v":689585,"d":"689,585"},{"v":710272.55,"d":"710,273"},{"v":731580.7265000001,"d":"731,581"},{"v":753528.1482950001,"d":"753,528"}]
[{"$nulls":6},"Impact Investing",{"$f":"SUMIF($G$150:$G$161,$G169,H$150:H$161)","v":0},0,0,0,0,0]
[{"$nulls":6},"Summe Nachhaltigkeit",{"$f":"SUM(H165:H169)","v":{"v":6600000,"d":"6,600,000"}},{"v":6651750,"d":"6,651,750"},{"v":6704271.25,"d":"6,704,271"},{"v":6757582.48125,"d":"6,757,582"},{"v":6811702.95990625,"d":"6,811,703"},{"v":6866652.502893282,"d":"6,866,653"}]
[{"$nulls":6},"Quote Nachhaltigkeit",{"$f":"H170-H165","v":{"v":6350000,"d":"6,350,000"}},{"$f":"I170/I18","v":{"v":0.8693109419413859,"d":"86.9%"}},{"$f":"J170/J18","v":{"v":0.8702018701639042,"d":"87.0%"}},{"v":0.8710938617259965,"d":"87.1%"},{"v":0.8719869399627043,"d":"87.2%"},{"v":0.8728811270572572,"d":"87.3%"}]
[{"$nulls":5},"Projektion Auswahl",{"$f":"Anlageziele!L22","v":"Best in Class"},{"$f":"SUMIF($G$165:$G$169,Anlageziele!$L$22,'Daten Projektion'!H165:H169)","v":{"v":5200000,"d":"5,200,000"}},{"$f":"SUMIF($G$165:$G$169,Anlageziele!$L$22,'Daten Projektion'!I165:I169)","v":{"v":5226000,"d":"5,226,000"}},{"$f":"SUMIF($G$165:$G$169,Anlageziele!$L$22,'Daten Projektion'!J165:J169)","v":{"v":5252130,"d":"5,252,130"}},{"$f":"SUMIF($G$165:$G$169,Anlageziele!$L$22,'Daten Projektion'!K165:K169)","v":{"v":5278390.65,"d":"5,278,391"}},{"$f":"SUMIF($G$165:$G$169,Anlageziele!$L$22,'Daten Projektion'!L165:L169)","v":{"v":5304782.603250001,"d":"5,304,783"}},{"$f":"SUMIF($G$165:$G$169,Anlageziele!$L$22,'Daten Projektion'!M165:M169)","v":{"v":5331306.516266251,"d":"5,331,307"}}]
[{"$nulls":5},"Ziel Auswahl",{"$f":"Anlageziele!L22","v":"Best in Class"},{"$f":"SUMIF($G$165:$G$169,Anlageziele!$L$22,'Daten Projektion'!H165:H169)","v":{"v":5200000,"d":"5,200,000"}},{"$f":"IF(I164>=Anlageziele!$L$19,'Daten Projektion'!I18*Anlageziele!$M$22,0)","v":0},{"$f":"IF(J164>=Anlageziele!$L$19,'Daten Projektion'!J18*Anlageziele!$M$22,0)","v":0},{"$f":"IF(K164>=Anlageziele!$L$19,'Daten Projektion'!K18*Anlageziele!$M$22,0)","v":{"v":775758.248125,"d":"775,758"}},{"$f":"IF(L164>=Anlageziele!$L$19,'Daten Projektion'!L18*Anlageziele!$M$22,0)","v":{"v":781170.295990625,"d":"781,170"}},{"$f":"IF(M164>=Anlageziele!$L$19,'Daten Projektion'!M18*Anlageziele!$M$22,0)","v":{"v":786665.2502893284,"d":"786,665"}}]
[{"$nulls":5},"Ziel","Impact Investing",null,{"$f":"IF(I164>=Anlageziele!$L$19,'Daten Projektion'!I18*Anlageziele!$M$21,0)","v":0},{"$f":"IF(J164>=Anlageziele!$L$19,'Daten Projektion'!J18*Anlageziele!$M$21,0)","v":0},{"$f":"IF(K164>=Anlageziele!$L$19,'Daten Projektion'!K18*Anlageziele!$M$21,0)","v":{"v":775758.248125,"d":"775,758"}},{"$f":"IF(L164>=Anlageziele!$L$19,'Daten Projektion'!L18*Anlageziele!$M$21,0)","v":{"v":781170.295990625,"d":"781,170"}},{"$f":"IF(M164>=Anlageziele!$L$19,'Daten Projektion'!M18*Anlageziele!$M$21,0)","v":{"v":786665.2502893284,"d":"786,665"}}]
[{"$nulls":6},"Nachhaltigkeitsziel",{"$f":"H170*Anlageziele!$M$20","v":{"v":4950000,"d":"4,950,000"}},{"$f":"IF(I164>=Anlageziele!$L$19,'Daten Projektion'!I18*Anlageziele!$M$20,999)","v":999},{"$f":"IF(J164>=Anlageziele!$L$19,'Daten Projektion'!J18*Anlageziele!$M$20,999)","v":999},{"$f":"IF(K164>=Anlageziele!$L$19,'Daten Projektion'!K18*Anlageziele!$M$20,999)","v":{"v":5818186.8609375,"d":"5,818,187"}},{"$f":"IF(L164>=Anlageziele!$L$19,'Daten Projektion'!L18*Anlageziele!$M$20,999)","v":{"v":5858777.219929688,"d":"5,858,777"}},{"$f":"IF(M164>=Anlageziele!$L$19,'Daten Projektion'!M18*Anlageziele!$M$20,999)","v":{"v":5899989.377169962,"d":"5,899,989"}}]
[{"$nulls":6},"Differenz EUR",{"$f":"H127*Anlageziele!M20-'Daten Projektion'!H170","v":{"v":-900000,"d":"-900,000 "}},{"$f":"I175-I170","v":{"v":-6650751,"d":"-6,650,751 "}},{"$f":"J175-J170","v":{"v":-6703272.25,"d":"-6,703,272 "}},{"v":-939395.6203124998,"d":"-939,396 "},{"v":-952925.7399765626,"d":"-952,926 "},{"v":-966663.1257233201,"d":"-966,663 "}]
[{"$nulls":6},"Differenz Quote",null,{"$f":"I176/I175","v":{"v":-6657.408408408409,"d":"-665740.8%"}},{"$f":"J176/J175","v":{"v":-6709.9822322322325,"d":"-670998.2%"}},{"v":-0.16145848230132856,"d":"-16.1%"},{"v":-0.16264925328360563,"d":"-16.3%"},{"v":-0.16384150274300963,"d":"-16.4%"}]
[{"$nulls":6},"Differenz Jahre",{"$f":"Anlageziele!L19-'Daten Projektion'!I164+1","v":3},{"$f":"Anlageziele!$L$19-'Daten Projektion'!I164","v":2},{"$f":"Anlageziele!$L$19-'Daten Projektion'!J164","v":1},{"$f":"Anlageziele!$L$19-'Daten Projektion'!K164","v":0},{"$f":"Anlageziele!$L$19-'Daten Projektion'!L164","v":-1},{"$f":"Anlageziele!$L$19-'Daten Projektion'!M164","v":-2}]
[{"$nulls":6},"Teilquote",{"$f":"I177/H178","v":{"v":-2219.1361361361364,"d":"-221913.6%"}}]
[]
[]
[{"$nulls":5},"Grafik Vergleich BC WC",null,null,{"$f":"I164","v":2019},{"$f":"J164","v":2020},2021,2022,2023]
[{"$nulls":6},"Vermögen Basiszenario",null,{"$f":"I31","v":{"v":7651750,"d":"7,651,750"}},{"$f":"J31","v":{"v":7704271.25,"d":"7,704,271"}},{"$f":"K31","v":{"v":7757582.48125,"d":"7,757,582"}},{"$f":"L31","v":{"v":7811702.95990625,"d":"7,811,703"}},{"$f":"M31","v":{"v":7866652.502893283,"d":"7,866,653"}}]
[{"$nulls":6},"Vermögen Worst Case",null,{"$f":"I140","v":{"v":7651750,"d":"7,651,750"}},{"$f":"J140","v":{"v":6928300,"d":"6,928,300"}},{"v":6972182.75,"d":"6,972,183"},{"v":7016661.65125,"d":"7,016,662"},{"v":7061750.48163125,"d":"7,061,750"}]
[{"$nulls":6},"Maximalverlust InvVerm.",null,{"$f":"I144","v":{"v":7341074.63813493,"d":"7,341,075"}},{"$f":"J144","v":{"v":7487896.130897629,"d":"7,487,896"}},{"v":7637654.053515582,"d":"7,637,654"},{"v":7790407.134585894,"d":"7,790,407"},{"v":7946215.277277612,"d":"7,946,215"}]
[{"$nulls":6},"Maximalverlust Grundstock",null,{"$f":"I145","v":{"v":6000000,"d":"6,000,000"}},{"$f":"J145","v":{"v":6000000,"d":"6,000,000"}},{"v":6000000,"d":"6,000,000"},{"v":6000000,"d":"6,000,000"},{"v":6000000,"d":"6,000,000"}]
[]
[{"$nulls":5},"Attribution"]

{"sheet":"Umschichtung","index":13,"n_rows":27,"n_cols":15,"rows_kept":27}
[]
[]
[]
[{"$nulls":6},"Anschaffung",{"$nulls":3},"Projektion Umschichtung",null,null,"Projektion Worst Case"]
[null,"Nr.","Vermögensgegenstand neu","Anlageklasse","Umschichung gegen Vermggst. alt","Nachhaltigkeit","Jahr","Wert EUR","Kosten %","Kosten EUR","Wertveränd. % p.a.","Ertrag % p.a.","Kosten EUR p.a.","Max. Verlust %","Verlustjahr"]
[null,"U1","Aufstockung VV Aktien","Aktien","Bankguthaben B-Bank","Best in Class",2020,{"v":500000,"d":"500,000"},{"v":0,"d":"0.0%"},{"$f":"H6*I6","v":0},{"v":0.03,"d":"3.0%"},{"v":0.02,"d":"2.0%"},{"v":2000,"d":"2,000"},{"v":-0.3,"d":"-30.0%"},2020]
[null,"U2","ABC Stiftungsfonds","Aktien","Bankguthaben B-Bank","Best in Class",2019,{"v":500000,"d":"500,000"},{"v":0,"d":"0.0%"},{"$f":"H7*I7","v":0},{"v":0.015,"d":"1.5%"},{"v":0.015,"d":"1.5%"},0,{"v":-0.1,"d":"-10.0%"},2020]
[null,"U3",null,null,0,"Bitte ausw.","Bitte ausw.",null,{"v":0,"d":"0.0%"},0,{"v":0,"d":"0.0%"},{"v":0,"d":"0.0%"},0,{"v":0,"d":"0.0%"},"Bitte ausw."]
[null,"U4",{"$nulls":3},"Bitte ausw.","Bitte ausw.",0,{"v":0,"d":"0.0%"},0,{"v":0,"d":"0.0%"},{"v":0,"d":"0.0%"},0,{"v":0,"d":"0.0%"},"Bitte ausw."]
[null,"U5",{"$nulls":3},"Bitte ausw.","Bitte ausw.",0,{"v":0,"d":"0.0%"},0,{"v":0,"d":"0.0%"},{"v":0,"d":"0.0%"},0,{"v":0,"d":"0.0%"},"Bitte ausw."]
[null,"U6",{"$nulls":3},"Bitte ausw.","Bitte ausw.",0,{"v":0,"d":"0.0%"},0,{"v":0,"d":"0.0%"},{"v":0,"d":"0.0%"},0,{"v":0,"d":"0.0%"},"Bitte ausw."]
[]
[]
[null,null,"Datum des Umschichtungsbeschlusses","2019-02-20"]
[null,null,"Der Umschichtungsbeschluss erfolgt","Bitte auswählen"]
[]
[null,null,"Informationsgrundlagen","Typ","Bezeichnung","Datum"]
[{"$nulls":3},"Beratungsgespräch","B-Bank","2019-02-15"]
[{"$nulls":3},"Bitte auswählen"]
[{"$nulls":3},"Bitte auswählen"]
[{"$nulls":3},"Bitte auswählen"]
[{"$nulls":3},"Bitte auswählen"]
[{"$nulls":3},"Bitte auswählen"]
[{"$nulls":3},"Bitte auswählen"]
[{"$nulls":3},"Bitte auswählen"]
[]
[null,null,"--- Ende der Eingaben ---"]

{"sheet":"Umschichtungsbeschluss","index":14,"n_rows":48,"n_cols":5,"rows_kept":48,"merged":[[4,1,4,5],[15,1,15,2],[17,1,17,4],[36,1,36,4]]}
[{"$f":"Einstellungen!D5","v":"Paradigma-Stiftung"}]
[]
[{"$f":"IF(Einstellungen!K9=\"Vorstand\",\"Vorstandsbeschluss vom\",IF(Einstellungen!K9=\"Geschäftsführung\",\"Beschluss der Geschäftsführung vom\",\"Beschluss des Geschäftsführungsgremiums vom\"))","v":"Vorstandsbeschluss vom"},null,{"$f":"Umschichtung!D14","v":"2019-02-20"},null,{"$f":"IF(Umschichtung!D15=\"im Umlaufverfahren\",\"(Auslauf)\",\"\")","v":""}]
[]
["1. ",{"$f":"IF(Umschichtung!D15=\"im Umlaufverfahren\",\"Mit der Beschlussfassung im Umlaufverfahren besteht Einverständnis.\",\"In seiner Sitzung vom oben genannten Datum hat das Geschäftsführungsorgan folgenden Beschluss gefasst.\")","v":"In seiner Sitzung vom oben genannten Datum hat das Geschäftsführungsorgan folgenden Beschluss gefasst."}]
[]
["2. ",{"$f":"IF(Einstellungen!K9=\"Vorstand\",\"Der Vorstand\",IF(Einstellungen!K9=\"Geschäftsführung\",\"Die Geschäftsführung\",\"Das Geschäftsführungsorgan\"))","v":"Der Vorstand"},"beschließt folgende Umschichtungen."]
[]
[null,"Neuinvestition","Abzubauende Position",null,"Wert EUR"]
[null,{"$f":"Umschichtung!C6","v":"Aufstockung VV Aktien"},{"$f":"IF(Umschichtung!E6=\"\",\"\",Umschichtung!E6)","v":"Bankguthaben B-Bank"},null,{"$f":"IF(Umschichtung!E6=\"\",\"\",Umschichtung!H6)","v":{"v":500000,"d":"500,000"}}]
[null,{"$f":"IF(Umschichtung!C7=\"\",\"\",Umschichtung!C7)","v":"ABC Stiftungsfonds"},{"$f":"IF(Umschichtung!E7=\"\",\"\",Umschichtung!E7)","v":"Bankguthaben B-Bank"},null,{"$f":"IF(Umschichtung!E7=\"\",\"\",Umschichtung!H7)","v":{"v":500000,"d":"500,000"}}]
[null,{"$f":"IF(Umschichtung!C8=\"\",\"\",Umschichtung!C8)","v":""},{"$f":"IF(Umschichtung!E8=\"\",\"\",Umschichtung!E8)","v":0},null,{"$f":"IF(Umschichtung!E8=\"\",\"\",Umschichtung!H8)","v":0}]
[null,{"$f":"IF(Umschichtung!C9=\"\",\"\",Umschichtung!C9)","v":""},{"$f":"IF(Umschichtung!E9=\"\",\"\",Umschichtung!E9)","v":""},null,{"$f":"IF(Umschichtung!E9=\"\",\"\",Umschichtung!H9)","v":""}]
[null,{"$f":"IF(Umschichtung!C10=\"\",\"\",Umschichtung!C10)","v":""},{"$f":"IF(Umschichtung!E10=\"\",\"\",Umschichtung!E10)","v":""},null,{"$f":"IF(Umschichtung!E10=\"\",\"\",Umschichtung!H10)","v":""}]
[null,{"$f":"IF(Umschichtung!C11=\"\",\"\",Umschichtung!C11)","v":""},{"$f":"IF(Umschichtung!E11=\"\",\"\",Umschichtung!E11)","v":""},null,{"$f":"IF(Umschichtung!E11=\"\",\"\",Umschichtung!H11)","v":""}]
[null,"Summe",null,null,{"$f":"SUM(E10:E15)","v":{"v":1000000,"d":"1,000,000"}}]
[]
["3.","Nach heutigem Kenntnisstand erwartet das Gremium in der Projektion folgende Auswirkungen der Umschichtungsentscheidungen auf die Erreichung der Anlageziele."]
[]
[null,"Zielabweichung","ohne Umschichtung","mit Umschichtung","Differenz"]
[null,"Vermögenserhaltung:",{"$f":"'Daten Umschichtung'!J63","v":{"v":-0.05951202969308525,"d":"-6.0%"}},{"$f":"'Daten Umschichtung'!J64","v":{"v":-0.0503009765070267,"d":"-5.0%"}},{"$f":"D21-C21","v":{"v":0.009211053186058547,"d":"0.9%"}}]
[null,"Erträge:",{"$f":"'Daten Umschichtung'!J106","v":{"v":-0.08269197369206437,"d":"-8.3%"}},{"$f":"'Daten Umschichtung'!J107","v":{"v":0.19209780486980418,"d":"19.2%"}},{"$f":"D22-C22","v":{"v":0.27478977856186854,"d":"27.5%"}}]
[null,"Risiko:",{"$f":"'Daten Umschichtung'!E155","v":{"v":-0.8724165980543941,"d":"-87.2%"}},{"$f":"'Daten Umschichtung'!E156","v":{"v":-1.0018254444193395,"d":"-100.2%"}},{"v":-0.12940884636494543,"d":"-12.9%"}]
[null,"Nachhaltigkeit:",{"$f":"'Daten Umschichtung'!J193","v":{"v":0.16384150274300963,"d":"16.4%"}},{"$f":"'Daten Umschichtung'!J194","v":{"v":0.3463918780843843,"d":"34.6%"}},{"v":0.1825503753413747,"d":"18.3%"}]
[]
["4.","Diese Einschätzung stützt sich auf folgende Informationen/Unterlagen."]
[]
[null,{"$f":"IF(Umschichtung!D18=\"Bitte auswählen\",\"\",Umschichtung!D18)","v":"Beratungsgespräch"},{"$f":"IF(Umschichtung!E18=\"\",\"\",Umschichtung!E18)","v":"B-Bank"},{"$f":"IF(Umschichtung!F18=\"\",\"\",\"vom\")","v":"vom"},{"$f":"IF(Umschichtung!F18=\"\",\"\",Umschichtung!F18)","v":"2019-02-15"}]
[null,{"$f":"IF(Umschichtung!D19=\"Bitte auswählen\",\"\",Umschichtung!D19)","v":""},{"$f":"IF(Umschichtung!E19=\"\",\"\",Umschichtung!E19)","v":""},{"$f":"IF(Umschichtung!F19=\"\",\"\",\"vom\")","v":""}]
[null,{"$f":"IF(Umschichtung!D20=\"Bitte auswählen\",\"\",Umschichtung!D20)","v":""},{"$f":"IF(Umschichtung!E20=\"\",\"\",Umschichtung!E20)","v":""},{"$f":"IF(Umschichtung!F20=\"\",\"\",\"vom\")","v":""}]
[null,{"$f":"IF(Umschichtung!D21=\"Bitte auswählen\",\"\",Umschichtung!D21)","v":""},{"$f":"IF(Umschichtung!E21=\"\",\"\",Umschichtung!E21)","v":""},{"$f":"IF(Umschichtung!F21=\"\",\"\",\"vom\")","v":""}]
[null,{"$f":"IF(Umschichtung!D22=\"Bitte auswählen\",\"\",Umschichtung!D22)","v":""},{"$f":"IF(Umschichtung!E22=\"\",\"\",Umschichtung!E22)","v":""},{"$f":"IF(Umschichtung!F22=\"\",\"\",\"vom\")","v":""}]
[null,{"$f":"IF(Umschichtung!D23=\"Bitte auswählen\",\"\",Umschichtung!D23)","v":""},{"$f":"IF(Umschichtung!E23=\"\",\"\",Umschichtung!E23)","v":""},{"$f":"IF(Umschichtung!F23=\"\",\"\",\"vom\")","v":""}]
[null,{"$f":"IF(Umschichtung!D24=\"Bitte auswählen\",\"\",Umschichtung!D24)","v":""},{"$f":"IF(Umschichtung!E24=\"\",\"\",Umschichtung!E24)","v":""},{"$f":"IF(Umschichtung!F24=\"\",\"\",\"vom\")","v":""}]
[null,{"$f":"IF(Umschichtung!D25=\"Bitte auswählen\",\"\",Umschichtung!D25)","v":""},{"$f":"IF(Umschichtung!E25=\"\",\"\",Umschichtung!E25)","v":""},{"$f":"IF(Umschichtung!F25=\"\",\"\",\"vom\")","v":""}]
[]
["5.","Keiner der am Entscheidungsprozess Beteiligten Personen und keiner diesen nahe stehenden Person bringt die Umschichtung einen unmittelbaren oder mittelbaren Vor- oder Nachteil."]
[]
[null,"_______________________________________","_______________________________________"]
[null,{"$f":"IF(Einstellungen!L12=\"\",\"\",Einstellungen!L12)","v":"Alfred Abel"},{"$f":"IF(Einstellungen!L13=\"\",\"\",Einstellungen!L13)","v":"Bertram Bauer"}]
[]
[null,{"$f":"IF(Einstellungen!L14=\"\",\"\",\"_______________________________________\")","v":"_______________________________________"},{"$f":"IF(Einstellungen!L13=\"\",\"\",\"_______________________________________\")","v":"_______________________________________"}]
[null,{"$f":"IF(Einstellungen!L14=\"\",\"\",Einstellungen!L14)","v":"Charlotte Cäsar"},{"$f":"IF(Einstellungen!L15=\"\",\"\",Einstellungen!L15)","v":"Dieter Döring"}]
[null,{"$f":"IF(Umschichtung!$D$15=\"im Umlaufverfahren\",IF(Einstellungen!L14=\"\",\"\",\"Ort, Datum\"),\"\")","v":""}]
[null,{"$f":"IF(Umschichtung!$D$15=\"im Umlaufverfahren\",IF(Einstellungen!L15=\"\",\"\",\"________________________________________\"),\"\")","v":""}]
[null,{"$f":"IF(Umschichtung!$D$15=\"im Umlaufverfahren\",IF(Einstellungen!L15=\"\",\"\",\"Ort, Datum\"),\"\")","v":""}]
[null,{"$f":"IF(Umschichtung!$D$15=\"im Umlaufverfahren\",IF(Einstellungen!L16=\"\",\"\",\"________________________________________\"),\"\")","v":""},{"$f":"IF(Einstellungen!L16=\"\",\"\",\"_______________________________________\")","v":""}]
[null,{"$f":"IF(Umschichtung!$D$15=\"im Umlaufverfahren\",IF(Einstellungen!L16=\"\",\"\",\"Ort, Datum\"),\"\")","v":""},{"$f":"IF(Einstellungen!L16=\"\",\"\",Einstellungen!L16)","v":""}]

{"sheet":"Zahlen Basis","index":15,"n_rows":56,"n_cols":11,"rows_kept":56,"merged":[[33,1,37,1]]}
[]
[null,null,"Analyse Basisszenario"]
[]
[null,null,"Beschreibung","Einh.","Bestand",{"$f":"Einstellungen!D7","v":2019},{"$f":"F4+1","v":2020},2021,2022,2023]
[]
[null,null,"Vermögen",{"$f":"Einstellungen!D9","v":"EUR "},{"$f":"SUM(E7:E9)+SUM(E14:E17)","v":{"v":7600000,"d":"7,600,000"}},{"v":7651750,"d":"7,651,750"},{"v":7704271.25,"d":"7,704,271"},{"v":7757582.48125,"d":"7,757,582"},{"v":7811702.95990625,"d":"7,811,703"},{"v":7866652.502893283,"d":"7,866,653"}]
[null,null,"Immobilien (Verkehrswert)",{"$f":"$D$6","v":"EUR "},{"$f":"IF(D7='Daten Einstellg_Ziele'!$B$8,Vermentw.!K6,Vermentw.!K6/1000)","v":{"v":500000,"d":"500,000"}},{"$f":"'Daten Projektion'!I20","v":{"v":505000,"d":"505,000"}},{"$f":"'Daten Projektion'!J20","v":{"v":510050,"d":"510,050"}},{"$f":"'Daten Projektion'!K20","v":{"v":515150.5,"d":"515,151"}},{"$f":"'Daten Projektion'!L20","v":{"v":520302.005,"d":"520,302"}},{"$f":"'Daten Projektion'!M20","v":{"v":525505.02505,"d":"525,505"}}]
[null,null,"Beteiligungen","EUR ",{"$f":"IF(D8='Daten Einstellg_Ziele'!$B$8,Vermentw.!K7,Vermentw.!K7/1000)","v":0},{"$f":"'Daten Projektion'!I21","v":0},{"$f":"'Daten Projektion'!J21","v":0},{"$f":"'Daten Projektion'!K21","v":0},{"$f":"'Daten Projektion'!L21","v":0},{"$f":"'Daten Projektion'!M21","v":0}]
[null,null,"Wertpapiere","EUR ",{"$f":"SUM(E10:E13)","v":{"v":6100000,"d":"6,100,000"}},{"v":6146750,"d":"6,146,750"},{"v":6194221.25,"d":"6,194,221"},{"v":6242431.98125,"d":"6,242,432"},{"v":6291400.95490625,"d":"6,291,401"},{"v":6341147.477843283,"d":"6,341,147"}]
[null,null," davon Aktien","EUR ",{"$f":"IF(D10='Daten Einstellg_Ziele'!$B$8,Vermentw.!K8,Vermentw.!K8/1000)","v":{"v":650000,"d":"650,000"}},{"$f":"'Daten Projektion'!I23","v":{"v":669500,"d":"669,500"}},{"$f":"'Daten Projektion'!J23","v":{"v":689585,"d":"689,585"}},{"$f":"'Daten Projektion'!K23","v":{"v":710272.55,"d":"710,273"}},{"$f":"'Daten Projektion'!L23","v":{"v":731580.7265000001,"d":"731,581"}},{"$f":"'Daten Projektion'!M23","v":{"v":753528.1482950001,"d":"753,528"}}]
[null,null," davon Renten","EUR ",{"$f":"IF(D11='Daten Einstellg_Ziele'!$B$8,Vermentw.!K9,Vermentw.!K9/1000)","v":{"v":5450000,"d":"5,450,000"}},{"$f":"'Daten Projektion'!I24","v":{"v":5477250,"d":"5,477,250"}},{"$f":"'Daten Projektion'!J24","v":{"v":5504636.25,"d":"5,504,636"}},{"$f":"'Daten Projektion'!K24","v":{"v":5532159.43125,"d":"5,532,159"}},{"$f":"'Daten Projektion'!L24","v":{"v":5559820.2284062505,"d":"5,559,820"}},{"$f":"'Daten Projektion'!M24","v":{"v":5587619.329548283,"d":"5,587,619"}}]
[null,null," davon Liquidität (Cashbestand in Fonds)","EUR ",0,{"$f":"'Daten Projektion'!I25","v":0},{"$f":"'Daten Projektion'!J25","v":0},{"$f":"'Daten Projektion'!K25","v":0},{"$f":"'Daten Projektion'!L25","v":0},{"$f":"'Daten Projektion'!M25","v":0}]
[null,null," davon Alternative Investments","EUR ",0,{"$f":"'Daten Projektion'!I26","v":0},{"$f":"'Daten Projektion'!J26","v":0},{"$f":"'Daten Projektion'!K26","v":0},{"$f":"'Daten Projektion'!L26","v":0},{"$f":"'Daten Projektion'!M26","v":0}]
[null,null,"Spar- und Termineinlagen","EUR ",{"$f":"IF(D14='Daten Einstellg_Ziele'!B8,Vermentw.!K10,Vermentw.!K10/1000)","v":0},{"$f":"'Daten Projektion'!I27","v":0},{"$f":"'Daten Projektion'!J27","v":0},{"$f":"'Daten Projektion'!K27","v":0},{"$f":"'Daten Projektion'!L27","v":0},{"$f":"'Daten Projektion'!M27","v":0}]
[null,null,"Kontoguthaben Investitionsvermögen","EUR ",{"$f":"IF(D15='Daten Einstellg_Ziele'!$B$8,Vermentw.!K11,Vermentw.!K11/1000)","v":{"v":1000000,"d":"1,000,000"}},{"$f":"'Daten Projektion'!I28","v":{"v":1000000,"d":"1,000,000"}},{"$f":"'Daten Projektion'!J28","v":{"v":1000000,"d":"1,000,000"}},{"$f":"'Daten Projektion'!K28","v":{"v":1000000,"d":"1,000,000"}},{"$f":"'Daten Projektion'!L28","v":{"v":1000000,"d":"1,000,000"}},{"$f":"'Daten Projektion'!M28","v":{"v":1000000,"d":"1,000,000"}}]
[null,null,"Sonstiges Vermögen","EUR ",{"$f":"IF(D16='Daten Einstellg_Ziele'!$B$8,Vermentw.!K12,Vermentw.!K12/1000)","v":0},{"$f":"'Daten Projektion'!I29","v":0},{"$f":"'Daten Projektion'!J29","v":0},{"$f":"'Daten Projektion'!K29","v":0},{"$f":"'Daten Projektion'!L29","v":0},{"$f":"'Daten Projektion'!M29","v":0}]
[null,null,"Verbindlichkeiten","EUR ",{"$f":"IF(D17='Daten Einstellg_Ziele'!$B$8,Vermentw.!K13,Vermentw.!K13/1000)","v":0},{"$f":"'Daten Projektion'!I30","v":0},{"$f":"'Daten Projektion'!J30","v":0},{"$f":"'Daten Projektion'!K30","v":0},{"$f":"'Daten Projektion'!L30","v":0},{"$f":"'Daten Projektion'!M30","v":0}]
[null,null,"Kennzahlen"]
[null,null,"Aktienquote Wertpapiere","%",{"$f":"E10/E9","v":{"v":0.10655737704918032,"d":"10.7%"}},{"v":0.10891934762272745,"d":"10.9%"},{"v":0.11132715028543741,"d":"11.1%"},{"v":0.1137813839435337,"d":"11.4%"},{"v":0.11628264225148269,"d":"11.6%"},{"v":0.11883151289698218,"d":"11.9%"}]
[null,null,"Aktienquote Gesamtvermögen","%",{"$f":"E10/E6","v":{"v":0.08552631578947369,"d":"8.6%"}},{"v":0.0874963243702421,"d":"8.7%"},{"v":0.08950684336302411,"d":"9.0%"},{"v":0.0915584915425291,"d":"9.2%"},{"v":0.09365188746357297,"d":"9.4%"},{"v":0.09578764894189229,"d":"9.6%"}]
[null,null,"Bestand freie Rücklage",{"$f":"D6","v":"EUR "},{"$f":"IF(Einstellungen!D9=\"TEUR\",Einstellungen!D29/1000,Einstellungen!D29)","v":{"v":10000,"d":"10,000"}},{"$f":"E21+E22","v":{"v":10000,"d":"10,000"}},{"v":21280,"d":"21,280"},{"v":33994.35,"d":"33,994"},{"v":46643.19325,"d":"46,643"},{"v":59226.80002124999,"d":"59,227"}]
[null,null,"Veränderung freie Rücklage inkl. Tilgung",{"$f":"D7","v":"EUR "},0,{"$f":"F49","v":{"v":11280,"d":"11,280"}},{"$f":"G49","v":{"v":12714.349999999999,"d":"12,714"}},{"v":12648.843249999998,"d":"12,649"},{"v":12583.606771249993,"d":"12,584"},{"v":12518.774352456268,"d":"12,519"}]
[null,null,"Bestand Umschichtungsrücklage",{"$f":"D8","v":"EUR "},{"$f":"IF(Einstellungen!D12=\"TEUR\",Einstellungen!D28/1000,Einstellungen!D28)","v":{"v":20000,"d":"20,000"}},{"$f":"E23+E24","v":{"v":20000,"d":"20,000"}},{"$f":"F23+F24","v":{"v":20000,"d":"20,000"}},{"v":20000,"d":"20,000"},{"v":20000,"d":"20,000"},{"v":20000,"d":"20,000"}]
[null,null,"Veränderung Umschichtungsrücklage",{"$f":"D9","v":"EUR "},0,{"$f":"IF(Einstellungen!$R$30=TRUE,(E10*Einstellungen!$D$37+'Zahlen Basis'!E11*Einstellungen!$D$38+'Zahlen Basis'!E12*Einstellungen!$D$39+'Zahlen Basis'!E13*Einstellungen!$D$40+'Zahlen Basis'!#REF!*Einstellungen!$D$41)-E9*Einstellungen!#REF!+IF(F4=Einstellungen!$T$40,Einstellungen!$S$40,0)+IF(F4=Einstellungen!$T$41,Einstellungen!$S$41,0)+IF(F4=Einstellungen!$T$42,Einstellungen!$S$42,0),0)","v":0},{"$f":"IF(Einstellungen!$R$30=TRUE,(F10*Einstellungen!$D$37+'Zahlen Basis'!F11*Einstellungen!$D$38+'Zahlen Basis'!F12*Einstellungen!$D$39+'Zahlen Basis'!F13*Einstellungen!$D$40+'Zahlen Basis'!#REF!*Einstellungen!$D$41)-F9*Einstellungen!#REF!+IF(G4=Einstellungen!$T$40,Einstellungen!$S$40,0)+IF(G4=Einstellungen!$T$41,Einstellungen!$S$41,0)+IF(G4=Einstellungen!$T$42,Einstellungen!$S$42,0),0)","v":0},{"$f":"IF(Einstellungen!$R$30=TRUE,(G10*Einstellungen!$D$37+'Zahlen Basis'!G11*Einstellungen!$D$38+'Zahlen Basis'!G12*Einstellungen!$D$39+'Zahlen Basis'!G13*Einstellungen!$D$40+'Zahlen Basis'!#REF!*Einstellungen!$D$41)-G9*Einstellungen!#REF!+IF(H4=Einstellungen!$T$40,Einstellungen!$S$40,0)+IF(H4=Einstellungen!$T$41,Einstellungen!$S$41,0)+IF(H4=Einstellungen!$T$42,Einstellungen!$S$42,0),0)","v":0},{"$f":"IF(Einstellungen!$R$30=TRUE,(H10*Einstellungen!$D$37+'Zahlen Basis'!H11*Einstellungen!$D$38+'Zahlen Basis'!H12*Einstellungen!$D$39+'Zahlen Basis'!H13*Einstellungen!$D$40+'Zahlen Basis'!#REF!*Einstellungen!$D$41)-H9*Einstellungen!#REF!+IF(I4=Einstellungen!$T$40,Einstellungen!$S$40,0)+IF(I4=Einstellungen!$T$41,Einstellungen!$S$41,0)+IF(I4=Einstellungen!$T$42,Einstellungen!$S$42,0),0)","v":0},{"$f":"IF(Einstellungen!$R$30=TRUE,(I10*Einstellungen!$D$37+'Zahlen Basis'!I11*Einstellungen!$D$38+'Zahlen Basis'!I12*Einstellungen!$D$39+'Zahlen Basis'!I13*Einstellungen!$D$40+'Zahlen Basis'!#REF!*Einstellungen!$D$41)-I9*Einstellungen!#REF!+IF(J4=Einstellungen!$T$40,Einstellungen!$S$40,0)+IF(J4=Einstellungen!$T$41,Einstellungen!$S$41,0)+IF(J4=Einstellungen!$T$42,Einstellungen!$S$42,0),0)","v":0}]
[null,null,"Grundstockvermögen (Soll)",{"$f":"D10","v":"EUR "},{"$f":"IF(Anlageziele!$E$5=\"Nominal\",'Daten VE'!$D$51,IF(Anlageziele!$E$5=\"Verbrauch\",'Daten VE'!$D$55,IF(Anlageziele!$E$5=\"Substanz\",'Zahlen Basis'!E6,'Daten VE'!$D$54)))","v":{"v":7575928.4191278955,"d":"7,575,928"}},{"$f":"IF(Anlageziele!$E$5=\"Nominal\",'Daten VE'!$D$51,IF(Anlageziele!$E$5=\"Verbrauch\",'Daten VE'!I40,IF(Anlageziele!$E$5=\"Substanz\",'Zahlen Basis'!F6,'Daten VE'!I38)))","v":{"v":7727446.987510453,"d":"7,727,447"}},{"$f":"IF(Anlageziele!$E$5=\"Nominal\",'Daten VE'!$D$51,IF(Anlageziele!$E$5=\"Verbrauch\",'Daten VE'!J40,IF(Anlageziele!$E$5=\"Substanz\",'Zahlen Basis'!G6,'Daten VE'!J38)))","v":{"v":7881995.927260662,"d":"7,881,996"}},{"$f":"IF(Anlageziele!$E$5=\"Nominal\",'Daten VE'!$D$51,IF(Anlageziele!$E$5=\"Verbrauch\",'Daten VE'!K40,IF(Anlageziele!$E$5=\"Substanz\",'Zahlen Basis'!H6,'Daten VE'!K38)))","v":{"v":8039635.845805876,"d":"8,039,636"}},{"$f":"IF(Anlageziele!$E$5=\"Nominal\",'Daten VE'!$D$51,IF(Anlageziele!$E$5=\"Verbrauch\",'Daten VE'!L40,IF(Anlageziele!$E$5=\"Substanz\",'Zahlen Basis'!I6,'Daten VE'!L38)))","v":{"v":8200428.562721994,"d":"8,200,429"}},{"$f":"IF(Anlageziele!$E$5=\"Nominal\",'Daten VE'!$D$51,IF(Anlageziele!$E$5=\"Verbrauch\",'Daten VE'!M40,IF(Anlageziele!$E$5=\"Substanz\",'Zahlen Basis'!J6,'Daten VE'!M38)))","v":{"v":8364437.133976433,"d":"8,364,437"}}]
[null,null,"Delta absolut",{"$f":"D12","v":"EUR "},{"$f":"E6-E25","v":{"v":24071.580872104503,"d":"24,072"}},{"v":-75696.98751045298,"d":"-75,697 "},{"v":-177724.67726066243,"d":"-177,725 "},{"v":-282053.36455587577,"d":"-282,053 "},{"v":-388725.60281574354,"d":"-388,726 "},{"v":-497784.6310831504,"d":"-497,785 "}]
[null,null,"Delta Prozent","%",{"$f":"E26/E6","v":{"v":0.003167313272645329,"d":"0.3%"}},{"v":-0.00989276799561577,"d":"-1.0%"},{"v":-0.023068330734157684,"d":"-2.3%"},{"v":-0.03635841001208765,"d":"-3.6%"},{"v":-0.049761953931285775,"d":"-5.0%"},{"v":-0.06327782127150904,"d":"-6.3%"}]
[]
[null,null,"Liquidität Saldo",{"$f":"D6","v":"EUR "},{"$f":"E31-E39","v":0},{"$f":"F31-F39","v":0},{"$f":"G31-G39","v":0},0,0,0]
[]
[null,null,"Einnahmen",{"$f":"D29","v":"EUR "},{"$f":"SUM(E32:E37)","v":0},{"$f":"SUM(F32:F38)","v":{"v":63500,"d":"63,500"}},{"$f":"SUM(G32:G38)","v":{"v":64248.75,"d":"64,249"}},{"v":65013.93125,"d":"65,014"},{"v":65795.99653125,"d":"65,796"},{"v":66595.41190765626,"d":"66,595"}]
[null,null,"Spenden",{"$f":"$D$31","v":"EUR "},0,{"$f":"'Einn._Ausg.'!C7","v":{"v":5000,"d":"5,000"}},{"$f":"'Einn._Ausg.'!D7","v":{"v":5000,"d":"5,000"}},{"$f":"'Einn._Ausg.'!E7","v":{"v":5000,"d":"5,000"}},{"$f":"'Einn._Ausg.'!F7","v":{"v":5000,"d":"5,000"}},{"$f":"'Einn._Ausg.'!G7","v":{"v":5000,"d":"5,000"}}]
[null,null,"Zustiftungen",{"$f":"$D$31","v":"EUR "},0,{"$f":"'Einn._Ausg.'!C8","v":0},{"$f":"'Einn._Ausg.'!D8","v":0},{"$f":"'Einn._Ausg.'!E8","v":0},{"$f":"'Einn._Ausg.'!F8","v":0},{"$f":"'Einn._Ausg.'!G8","v":0}]
[null,"Ordtl. Erträge","Mieterträge (brutto)","EUR ",0,{"$f":"'Daten Projektion'!I50","v":{"v":10000,"d":"10,000"}},{"$f":"'Daten Projektion'!J50","v":{"v":10100,"d":"10,100"}},{"$f":"'Daten Projektion'!K50","v":{"v":10201,"d":"10,201"}},{"$f":"'Daten Projektion'!L50","v":{"v":10303.01,"d":"10,303"}},{"$f":"'Daten Projektion'!M50","v":{"v":10406.0401,"d":"10,406"}}]
[null,null,"Erträge aus Beteiligungen","EUR ",0,{"$f":"'Daten Projektion'!I51","v":0},{"$f":"'Daten Projektion'!J51","v":0},{"$f":"'Daten Projektion'!K51","v":0},{"$f":"'Daten Projektion'!L51","v":0},{"$f":"'Daten Projektion'!M51","v":0}]
[null,null,"Wertpapiererträge (brutto)","EUR ",0,{"$f":"'Daten Projektion'!I52","v":{"v":48500,"d":"48,500"}},{"$f":"'Daten Projektion'!J52","v":{"v":49148.75,"d":"49,149"}},{"$f":"'Daten Projektion'!K52","v":{"v":49812.93125,"d":"49,813"}},{"$f":"'Daten Projektion'!L52","v":{"v":50492.986531250004,"d":"50,493"}},{"$f":"'Daten Projektion'!M52","v":{"v":51189.37180765626,"d":"51,189"}}]
[null,null,"Zinsen und ähnliche Erträge","EUR ",0,{"$f":"'Daten Projektion'!I57","v":0},{"$f":"'Daten Projektion'!J57","v":0},{"$f":"'Daten Projektion'!K57","v":0},{"$f":"'Daten Projektion'!L57","v":0},{"$f":"'Daten Projektion'!M57","v":0}]
[null,null,"Erträge aus sonstigem Vermögen","EUR ",0,{"$f":"'Daten Projektion'!I59","v":0},{"$f":"'Daten Projektion'!J59","v":0},{"$f":"'Daten Projektion'!K59","v":0},{"$f":"'Daten Projektion'!L59","v":0},{"$f":"'Daten Projektion'!M59","v":0}]
[null,null,"Ausgaben","EUR ",0,{"$f":"SUM(F40:F42)+SUM(F46:F50)","v":{"v":63500,"d":"63,500"}},{"$f":"SUM(G40:G42)+SUM(G46:G50)","v":{"v":64248.75,"d":"64,249"}},{"v":65013.93125000001,"d":"65,014"},{"v":65795.99653125,"d":"65,796"},{"v":66595.41190765626,"d":"66,595"}]
[null,null,"Ausgaben für den Stiftungszweck","EUR ",0,{"$f":"IF(Anlageziele!$M$5='Daten Einstellg_Ziele'!$D$21,Anlageziele!$M$7,IF(Anlageziele!$M$5='Daten Einstellg_Ziele'!$D$22,'Daten VE'!$D$51*Anlageziele!M7%,F31-F41-F42-F46-F47-F47-F48-F49-F50))","v":{"v":10000,"d":"10,000"}},{"$f":"IF(Anlageziele!$M$5='Daten Einstellg_Ziele'!$D$21,Anlageziele!$M$7,IF(Anlageziele!$M$5='Daten Einstellg_Ziele'!$D$22,'Daten VE'!$D$51*Anlageziele!N7%,G31-G41-G42-G46-G47-G47-G48-G49-G50))","v":{"v":10000,"d":"10,000"}},{"$f":"IF(Anlageziele!$M$5='Daten Einstellg_Ziele'!$D$21,Anlageziele!$M$7,IF(Anlageziele!$M$5='Daten Einstellg_Ziele'!$D$22,'Daten VE'!$D$51*Anlageziele!O7%,H31-H41-H42-H46-H47-H47-H48-H49-H50))","v":{"v":10000,"d":"10,000"}},{"$f":"IF(Anlageziele!$M$5='Daten Einstellg_Ziele'!$D$21,Anlageziele!$M$7,IF(Anlageziele!$M$5='Daten Einstellg_Ziele'!$D$22,'Daten VE'!$D$51*Anlageziele!P7%,I31-I41-I42-I46-I47-I47-I48-I49-I50))","v":{"v":10000,"d":"10,000"}},{"$f":"IF(Anlageziele!$M$5='Daten Einstellg_Ziele'!$D$21,Anlageziele!$M$7,IF(Anlageziele!$M$5='Daten Einstellg_Ziele'!$D$22,'Daten VE'!$D$51*Anlageziele!Q7%,J31-J41-J42-J46-J47-J47-J48-J49-J50))","v":{"v":10000,"d":"10,000"}}]
[null,null,"Allg. Verwaltungskosten","EUR ",0,{"$f":"'Einn._Ausg.'!C28","v":{"v":28000,"d":"28,000"}},{"$f":"'Einn._Ausg.'!D28","v":{"v":27030,"d":"27,030"}},{"$f":"'Einn._Ausg.'!E28","v":{"v":27570.600000000002,"d":"27,571"}},{"$f":"'Einn._Ausg.'!F28","v":{"v":28122.012,"d":"28,122"}},{"$f":"'Einn._Ausg.'!G28","v":{"v":28684.452240000002,"d":"28,684"}}]
[null,null,"Kosten Vermögensverwaltung","EUR ",0,{"$f":"'Daten Projektion'!I91","v":{"v":11220,"d":"11,220"}},{"$f":"'Daten Projektion'!J91","v":{"v":11444.4,"d":"11,444"}},{"$f":"'Daten Projektion'!K91","v":{"v":11673.288,"d":"11,673"}},{"$f":"'Daten Projektion'!L91","v":{"v":11906.75376,"d":"11,907"}},{"$f":"'Daten Projektion'!M91","v":{"v":12144.8888352,"d":"12,145"}}]
[null,null," davon Immobilien","EUR ",0,{"$f":"'Daten Projektion'!I80","v":{"v":5100,"d":"5,100"}},{"$f":"'Daten Projektion'!J80","v":{"v":5202,"d":"5,202"}},{"$f":"'Daten Projektion'!K80","v":{"v":5306.04,"d":"5,306"}},{"$f":"'Daten Projektion'!L80","v":{"v":5412.1608,"d":"5,412"}},{"$f":"'Daten Projektion'!M80","v":{"v":5520.4040159999995,"d":"5,520"}}]
[null,null," davon Beteiligungen","EUR ",0,{"$f":"'Daten Projektion'!I81","v":0},{"$f":"'Daten Projektion'!J81","v":0},{"$f":"'Daten Projektion'!K81","v":0},{"$f":"'Daten Projektion'!L81","v":0},{"$f":"'Daten Projektion'!M81","v":0}]
[null,null," davon Wertpapiere","EUR ",0,{"$f":"'Daten Projektion'!I82","v":{"v":6120,"d":"6,120"}},{"$f":"'Daten Projektion'!J82","v":{"v":6242.4,"d":"6,242"}},{"$f":"'Daten Projektion'!K82","v":{"v":6367.248,"d":"6,367"}},{"$f":"'Daten Projektion'!L82","v":{"v":6494.59296,"d":"6,495"}},{"$f":"'Daten Projektion'!M82","v":{"v":6624.4848192,"d":"6,624"}}]
[null,null,"Sollzinsen","EUR ",0,{"$f":"'Daten Projektion'!I60*-1","v":0},{"$f":"'Daten Projektion'!J60*-1","v":0},{"$f":"'Daten Projektion'!K60*-1","v":0},{"$f":"'Daten Projektion'!L60*-1","v":0},{"$f":"'Daten Projektion'!M60*-1","v":0}]
[null,null,"Tilgung",{"$f":"$D$31","v":"EUR "},0,{"$f":"(E17-F17)*-1","v":0},{"$f":"(F17-G17)*-1","v":0},{"$f":"(G17-H17)*-1","v":0},{"$f":"(H17-I17)*-1","v":0},{"$f":"(I17-J17)*-1","v":0}," "]
[null,null,"Sonstige Aufwände","EUR ",0,{"$f":"'Einn._Ausg.'!C27","v":{"v":3000,"d":"3,000"}},{"$f":"'Einn._Ausg.'!D27","v":{"v":3060,"d":"3,060"}},{"$f":"'Einn._Ausg.'!E27","v":{"v":3121.2,"d":"3,121"}},{"$f":"'Einn._Ausg.'!F27","v":{"v":3183.624,"d":"3,184"}},{"$f":"'Einn._Ausg.'!G27","v":{"v":3247.29648,"d":"3,247"}}]
[null,null,"Zuführung Freie Rücklage","EUR ",0,{"$f":"IF(Anlageziele!$M$5=\"Überschuss\",'Daten Projektion'!I106,'Daten Projektion'!I110)","v":{"v":11280,"d":"11,280"}},{"$f":"IF(Anlageziele!$M$5=\"Überschuss\",'Daten Projektion'!J106,'Daten Projektion'!J110)","v":{"v":12714.349999999999,"d":"12,714"}},{"$f":"IF(Anlageziele!$M$5=\"Überschuss\",'Daten Projektion'!K106,'Daten Projektion'!K110)","v":{"v":12648.843249999998,"d":"12,649"}},{"$f":"IF(Anlageziele!$M$5=\"Überschuss\",'Daten Projektion'!L106,'Daten Projektion'!L110)","v":{"v":12583.606771249993,"d":"12,584"}},{"$f":"IF(Anlageziele!$M$5=\"Überschuss\",'Daten Projektion'!M106,'Daten Projektion'!M110)","v":{"v":12518.774352456268,"d":"12,519"}}]
[null,null,"Neuanlage","EUR ",{"$f":"E33","v":0},{"$f":"F33","v":0},{"$f":"G33","v":0},0,0,0]
[null,null,"Kennzahlen",null," "]
[null,null,"Ausschüttungsrendite brutto","%",{"v":0,"d":"0.0%"},{"$f":"SUM(F34:F38)/E6","v":{"v":0.007697368421052632,"d":"0.8%"}},{"$f":"SUM(G34:G38)/F6","v":{"v":0.007743163328650309,"d":"0.8%"}},{"$f":"SUM(H34:H38)/G6","v":{"v":0.007789696040362027,"d":"0.8%"}},{"$f":"SUM(I34:I38)/H6","v":{"v":0.007836977135363153,"d":"0.8%"}},{"$f":"SUM(J34:J38)/I6","v":{"v":0.007885017162556764,"d":"0.8%"}}]
[null,null,"Verwaltungskostenquote 1 (Aufsicht)","%",{"v":0,"d":"0.0%"},{"$f":"(F41+F42)/(F31-F33)","v":{"v":0.6176377952755906,"d":"61.8%"}},{"$f":"(G41+G42)/(G31-G33)","v":{"v":0.5988349967898209,"d":"59.9%"}},{"v":0.6036227504701157,"d":"60.4%"},{"v":0.6083769206381457,"d":"60.8%"},{"v":0.6130954056086555,"d":"61.3%"}]
[null,null,"Verwaltungskostenquote 2 (Finanzamt)","%",{"v":0,"d":"0.0%"},{"$f":"F41/(F31-F42-F33)","v":{"v":0.5355776587605203,"d":"53.6%"}},{"$f":"G41/(G31-G42-G33)","v":{"v":0.511889645455346,"d":"51.2%"}},{"v":0.5168779062295992,"d":"51.7%"},{"v":0.5218483421519358,"d":"52.2%"},{"v":0.5267984699032212,"d":"52.7%"}]
[null,null,"Zweckeffizienz der Erträge","%",{"v":0,"d":"0.0%"},{"$f":"F40/(F31-F33)","v":{"v":0.15748031496062992,"d":"15.7%"}},{"$f":"G40/(G31-G33)","v":{"v":0.15564505146014515,"d":"15.6%"}},{"v":0.15381318753893997,"d":"15.4%"},{"v":0.15198493110823955,"d":"15.2%"},{"v":0.15016049474799226,"d":"15.0%"}]
[null,null,"Zweckeffizienz des Vermögens","%",{"$f":"E40/E6","v":{"v":0,"d":"0.0%"}},{"v":1.3068905805861404E-3,"d":"0.1%"},{"v":1.2979812983609578E-3,"d":"0.1%"},{"v":1.2890613827400354E-3,"d":"0.1%"},{"v":0.001280130600372958,"d":"0.1%"},{"v":1.2711887294274268E-3,"d":"0.1%"}]

{"sheet":"Zahlen Worst Case","index":16,"n_rows":56,"n_cols":11,"rows_kept":56,"merged":[[33,1,37,1]]}
[]
[null,null,"Analyse Worst Case"]
[]
[null,null,"Beschreibung","Einh.","Bestand",{"$f":"Einstellungen!D7","v":2019},{"$f":"F4+1","v":2020},2021,2022,2023]
[]
[null,null,"Vermögen",{"$f":"Einstellungen!D9","v":"EUR "},{"$f":"SUM(E7:E9)+SUM(E14:E17)","v":{"v":7600000,"d":"7,600,000"}},{"v":7651750,"d":"7,651,750"},{"v":6928300,"d":"6,928,300"},{"v":6972182.75,"d":"6,972,183"},{"v":7016661.65125,"d":"7,016,662"},{"v":7061750.48163125,"d":"7,061,750"}]
[null,null,"Immobilien (Verkehrswert)",{"$f":"$D$6","v":"EUR "},{"$f":"IF(D7='Daten Einstellg_Ziele'!$B$8,Vermentw.!K6,Vermentw.!K6/1000)","v":{"v":500000,"d":"500,000"}},{"$f":"'Daten Projektion'!I129","v":{"v":505000,"d":"505,000"}},{"$f":"'Daten Projektion'!J129","v":{"v":505000,"d":"505,000"}},{"$f":"'Daten Projektion'!K129","v":{"v":510050,"d":"510,050"}},{"$f":"'Daten Projektion'!L129","v":{"v":515150.5,"d":"515,151"}},{"$f":"'Daten Projektion'!M129","v":{"v":520302.005,"d":"520,302"}}]
[null,null,"Beteiligungen","EUR ",{"$f":"IF(D8='Daten Einstellg_Ziele'!$B$8,Vermentw.!K7,Vermentw.!K7/1000)","v":0},{"$f":"'Daten Projektion'!I130","v":0},{"$f":"'Daten Projektion'!J130","v":0},{"$f":"'Daten Projektion'!K130","v":0},{"$f":"'Daten Projektion'!L130","v":0},{"$f":"'Daten Projektion'!M130","v":0}]
[null,null,"Wertpapiere","EUR ",{"$f":"SUM(E10:E13)","v":{"v":6100000,"d":"6,100,000"}},{"v":6146750,"d":"6,146,750"},{"v":5423300,"d":"5,423,300"},{"v":5462132.75,"d":"5,462,133"},{"v":5501511.15125,"d":"5,501,511"},{"v":5541448.47663125,"d":"5,541,448"}]
[null,null," davon Aktien","EUR ",{"$f":"IF(D10='Daten Einstellg_Ziele'!$B$8,Vermentw.!K8,Vermentw.!K8/1000)","v":{"v":650000,"d":"650,000"}},{"$f":"'Daten Projektion'!I132","v":{"v":669500,"d":"669,500"}},{"$f":"'Daten Projektion'!J132","v":{"v":468650,"d":"468,650"}},{"$f":"'Daten Projektion'!K132","v":{"v":482709.5,"d":"482,710"}},{"$f":"'Daten Projektion'!L132","v":{"v":497190.785,"d":"497,191"}},{"$f":"'Daten Projektion'!M132","v":{"v":512106.50854999997,"d":"512,107"}}]
[null,null," davon Renten","EUR ",{"$f":"IF(D11='Daten Einstellg_Ziele'!$B$8,Vermentw.!K9,Vermentw.!K9/1000)","v":{"v":5450000,"d":"5,450,000"}},{"$f":"'Daten Projektion'!I133","v":{"v":5477250,"d":"5,477,250"}},{"$f":"'Daten Projektion'!J133","v":{"v":4954650,"d":"4,954,650"}},{"$f":"'Daten Projektion'!K133","v":{"v":4979423.25,"d":"4,979,423"}},{"$f":"'Daten Projektion'!L133","v":{"v":5004320.36625,"d":"5,004,320"}},{"$f":"'Daten Projektion'!M133","v":{"v":5029341.96808125,"d":"5,029,342"}}]
[null,null," davon Liquidität (Cashbestand in Fonds)","EUR ",0,{"$f":"'Daten Projektion'!I134","v":0},{"$f":"'Daten Projektion'!J134","v":0},{"$f":"'Daten Projektion'!K134","v":0},{"$f":"'Daten Projektion'!L134","v":0},{"$f":"'Daten Projektion'!M134","v":0}]
[null,null," davon Alternative Investments","EUR ",0,{"$f":"'Daten Projektion'!I135","v":0},{"$f":"'Daten Projektion'!J135","v":0},{"$f":"'Daten Projektion'!K135","v":0},{"$f":"'Daten Projektion'!L135","v":0},{"$f":"'Daten Projektion'!M26","v":0}]
[null,null,"Spar- und Termineinlagen","EUR ",{"$f":"IF(D14='Daten Einstellg_Ziele'!B8,Vermentw.!K10,Vermentw.!K10/1000)","v":0},{"$f":"'Daten Projektion'!I136","v":0},{"$f":"'Daten Projektion'!J136","v":0},{"$f":"'Daten Projektion'!K136","v":0},{"$f":"'Daten Projektion'!L136","v":0},{"$f":"'Daten Projektion'!M136","v":0}]
[null,null,"Kontoguthaben Investitionsvermögen","EUR ",{"$f":"IF(D15='Daten Einstellg_Ziele'!$B$8,Vermentw.!K11,Vermentw.!K11/1000)","v":{"v":1000000,"d":"1,000,000"}},{"$f":"'Daten Projektion'!I137","v":{"v":1000000,"d":"1,000,000"}},{"$f":"'Daten Projektion'!J137","v":{"v":1000000,"d":"1,000,000"}},{"$f":"'Daten Projektion'!K137","v":{"v":1000000,"d":"1,000,000"}},{"$f":"'Daten Projektion'!L137","v":{"v":1000000,"d":"1,000,000"}},{"$f":"'Daten Projektion'!M137","v":{"v":1000000,"d":"1,000,000"}}]
[null,null,"Sonstiges Vermögen","EUR ",{"$f":"IF(D16='Daten Einstellg_Ziele'!$B$8,Vermentw.!K12,Vermentw.!K12/1000)","v":0},{"$f":"'Daten Projektion'!I138","v":0},{"$f":"'Daten Projektion'!J138","v":0},{"$f":"'Daten Projektion'!K138","v":0},{"$f":"'Daten Projektion'!L138","v":0},{"$f":"'Daten Projektion'!M138","v":0}]
[null,null,"Verbindlichkeiten","EUR ",{"$f":"IF(D17='Daten Einstellg_Ziele'!$B$8,Vermentw.!K13,Vermentw.!K13/1000)","v":0},{"$f":"'Daten Projektion'!I139","v":0},{"$f":"'Daten Projektion'!J139","v":0},{"$f":"'Daten Projektion'!K139","v":0},{"$f":"'Daten Projektion'!L139","v":0},{"$f":"'Daten Projektion'!M139","v":0}]
[null,null,"Kennzahlen"]
[null,null,"Aktienquote Wertpapiere","%",{"$f":"E10/E9","v":{"v":0.10655737704918032,"d":"10.7%"}},{"v":0.10891934762272745,"d":"10.9%"},{"v":0.08641417587077978,"d":"8.6%"},{"v":0.08837381332410861,"d":"8.8%"},{"v":0.09037349399665091,"d":"9.0%"},{"v":0.09241383560807175,"d":"9.2%"}]
[null,null,"Aktienquote Gesamtvermögen","%",{"$f":"E10/E6","v":{"v":0.08552631578947369,"d":"8.6%"}},{"v":0.0874963243702421,"d":"8.7%"},{"v":0.06764285611188892,"d":"6.8%"},{"v":0.06923362701587246,"d":"6.9%"},{"v":0.07085859482926994,"d":"7.1%"},{"v":0.07251835219639542,"d":"7.3%"}]
[null,null,"Bestand freie Rücklage",{"$f":"D6","v":"EUR "},{"$f":"IF(Einstellungen!D9=\"TEUR\",Einstellungen!D29/1000,Einstellungen!D29)","v":{"v":10000,"d":"10,000"}},{"$f":"E21+E22","v":{"v":10000,"d":"10,000"}},{"v":31279.999999999993,"d":"31,280"},{"v":53994.349999999984,"d":"53,994"},{"v":76643.19324999998,"d":"76,643"},{"v":99226.80002124998,"d":"99,227"}]
[null,null,"Veränderung freie Rücklage inkl. Tilgung",{"$f":"D7","v":"EUR "},0,{"$f":"F49","v":{"v":21279.999999999993,"d":"21,280"}},{"$f":"G49","v":{"v":22714.34999999999,"d":"22,714"}},{"$f":"H49","v":{"v":22648.843249999994,"d":"22,649"}},{"$f":"I49","v":{"v":22583.60677125,"d":"22,584"}},{"$f":"J49","v":{"v":22518.77435245626,"d":"22,519"}}]
[null,null,"Bestand Umschichtungsrücklage",{"$f":"D8","v":"EUR "},{"$f":"IF(Einstellungen!D12=\"TEUR\",Einstellungen!D28/1000,Einstellungen!D28)","v":{"v":20000,"d":"20,000"}},{"$f":"E23+E24","v":{"v":20000,"d":"20,000"}},{"$f":"F23+F24","v":{"v":20000,"d":"20,000"}},{"v":20000,"d":"20,000"},{"v":20000,"d":"20,000"},{"v":20000,"d":"20,000"}]
[null,null,"Veränderung Umschichtungsrücklage",{"$f":"D9","v":"EUR "},0,{"$f":"IF(Einstellungen!$R$30=TRUE,(E10*Einstellungen!$D$37+'Zahlen Worst Case'!E11*Einstellungen!$D$38+'Zahlen Worst Case'!E12*Einstellungen!$D$39+'Zahlen Worst Case'!E13*Einstellungen!$D$40+'Zahlen Worst Case'!#REF!*Einstellungen!$D$41)-E9*Einstellungen!#REF!+IF(F4=Einstellungen!$T$40,Einstellungen!$S$40,0)+IF(F4=Einstellungen!$T$41,Einstellungen!$S$41,0)+IF(F4=Einstellungen!$T$42,Einstellungen!$S$42,0),0)","v":0},{"$f":"IF(Einstellungen!$R$30=TRUE,(F10*Einstellungen!$D$37+'Zahlen Worst Case'!F11*Einstellungen!$D$38+'Zahlen Worst Case'!F12*Einstellungen!$D$39+'Zahlen Worst Case'!F13*Einstellungen!$D$40+'Zahlen Worst Case'!#REF!*Einstellungen!$D$41)-F9*Einstellungen!#REF!+IF(G4=Einstellungen!$T$40,Einstellungen!$S$40,0)+IF(G4=Einstellungen!$T$41,Einstellungen!$S$41,0)+IF(G4=Einstellungen!$T$42,Einstellungen!$S$42,0),0)","v":0},{"$f":"IF(Einstellungen!$R$30=TRUE,(G10*Einstellungen!$D$37+'Zahlen Worst Case'!G11*Einstellungen!$D$38+'Zahlen Worst Case'!G12*Einstellungen!$D$39+'Zahlen Worst Case'!G13*Einstellungen!$D$40+'Zahlen Worst Case'!#REF!*Einstellungen!$D$41)-G9*Einstellungen!#REF!+IF(H4=Einstellungen!$T$40,Einstellungen!$S$40,0)+IF(H4=Einstellungen!$T$41,Einstellungen!$S$41,0)+IF(H4=Einstellungen!$T$42,Einstellungen!$S$42,0),0)","v":0},{"$f":"IF(Einstellungen!$R$30=TRUE,(H10*Einstellungen!$D$37+'Zahlen Worst Case'!H11*Einstellungen!$D$38+'Zahlen Worst Case'!H12*Einstellungen!$D$39+'Zahlen Worst Case'!H13*Einstellungen!$D$40+'Zahlen Worst Case'!#REF!*Einstellungen!$D$41)-H9*Einstellungen!#REF!+IF(I4=Einstellungen!$T$40,Einstellungen!$S$40,0)+IF(I4=Einstellungen!$T$41,Einstellungen!$S$41,0)+IF(I4=Einstellungen!$T$42,Einstellungen!$S$42,0),0)","v":0},{"$f":"IF(Einstellungen!$R$30=TRUE,(I10*Einstellungen!$D$37+'Zahlen Worst Case'!I11*Einstellungen!$D$38+'Zahlen Worst Case'!I12*Einstellungen!$D$39+'Zahlen Worst Case'!I13*Einstellungen!$D$40+'Zahlen Worst Case'!#REF!*Einstellungen!$D$41)-I9*Einstellungen!#REF!+IF(J4=Einstellungen!$T$40,Einstellungen!$S$40,0)+IF(J4=Einstellungen!$T$41,Einstellungen!$S$41,0)+IF(J4=Einstellungen!$T$42,Einstellungen!$S$42,0),0)","v":0}]
[null,null,"Grundstockvermögen (Soll)",{"$f":"D10","v":"EUR "},{"$f":"IF(Anlageziele!$E$5=\"Nominal\",'Daten VE'!$D$51,IF(Anlageziele!$E$5=\"Verbrauch\",'Daten VE'!$D$55,IF(Anlageziele!$E$5=\"Substanz\",'Zahlen Worst Case'!E6,'Daten VE'!$D$54)))","v":{"v":7575928.4191278955,"d":"7,575,928"}},{"$f":"IF(Anlageziele!$E$5=\"Nominal\",'Daten VE'!$D$51,IF(Anlageziele!$E$5=\"Verbrauch\",'Daten VE'!I40,IF(Anlageziele!$E$5=\"Substanz\",'Zahlen Worst Case'!F6,'Daten VE'!I38)))","v":{"v":7727446.987510453,"d":"7,727,447"}},{"$f":"IF(Anlageziele!$E$5=\"Nominal\",'Daten VE'!$D$51,IF(Anlageziele!$E$5=\"Verbrauch\",'Daten VE'!J40,IF(Anlageziele!$E$5=\"Substanz\",'Zahlen Worst Case'!G6,'Daten VE'!J38)))","v":{"v":7881995.927260662,"d":"7,881,996"}},{"$f":"IF(Anlageziele!$E$5=\"Nominal\",'Daten VE'!$D$51,IF(Anlageziele!$E$5=\"Verbrauch\",'Daten VE'!K40,IF(Anlageziele!$E$5=\"Substanz\",'Zahlen Worst Case'!H6,'Daten VE'!K38)))","v":{"v":8039635.845805876,"d":"8,039,636"}},{"$f":"IF(Anlageziele!$E$5=\"Nominal\",'Daten VE'!$D$51,IF(Anlageziele!$E$5=\"Verbrauch\",'Daten VE'!L40,IF(Anlageziele!$E$5=\"Substanz\",'Zahlen Worst Case'!I6,'Daten VE'!L38)))","v":{"v":8200428.562721994,"d":"8,200,429"}},{"$f":"IF(Anlageziele!$E$5=\"Nominal\",'Daten VE'!$D$51,IF(Anlageziele!$E$5=\"Verbrauch\",'Daten VE'!M40,IF(Anlageziele!$E$5=\"Substanz\",'Zahlen Worst Case'!J6,'Daten VE'!M38)))","v":{"v":8364437.133976433,"d":"8,364,437"}}]
[null,null,"Delta absolut",{"$f":"D12","v":"EUR "},{"$f":"E6-E25","v":{"v":24071.580872104503,"d":"24,072"}},{"v":-75696.98751045298,"d":"-75,697 "},{"v":-953695.9272606624,"d":"-953,696 "},{"v":-1067453.095805876,"d":"-1,067,453 "},{"v":-1183766.9114719937,"d":"-1,183,767 "},{"v":-1302686.6523451833,"d":"-1,302,687 "}]
[null,null,"Delta Prozent","%",{"$f":"E26/E6","v":{"v":0.003167313272645329,"d":"0.3%"}},{"v":-0.00989276799561577,"d":"-1.0%"},{"v":-0.13765222742385036,"d":"-13.8%"},{"v":-0.15310170918940355,"d":"-15.3%"},{"v":-0.16870799395908004,"d":"-16.9%"},{"v":-0.184470784649455,"d":"-18.4%"}]
[]
[null,null,"Liquidität Saldo",{"$f":"D6","v":"EUR "},{"$f":"E31-E39","v":0},{"$f":"F31-F39","v":0},{"$f":"G31-G39","v":0},0,0,0]
[]
[null,null,"Einnahmen",{"$f":"D29","v":"EUR "},{"$f":"SUM(E32:E37)","v":0},{"$f":"SUM(F32:F38)","v":{"v":63500,"d":"63,500"}},{"$f":"SUM(G32:G38)","v":{"v":64248.75,"d":"64,249"}},{"v":65013.93125,"d":"65,014"},{"v":65795.99653125,"d":"65,796"},{"v":66595.41190765626,"d":"66,595"}]
[null,null,"Spenden",{"$f":"$D$31","v":"EUR "},0,{"$f":"'Einn._Ausg.'!C7","v":{"v":5000,"d":"5,000"}},{"$f":"'Einn._Ausg.'!D7","v":{"v":5000,"d":"5,000"}},{"$f":"'Einn._Ausg.'!E7","v":{"v":5000,"d":"5,000"}},{"$f":"'Einn._Ausg.'!F7","v":{"v":5000,"d":"5,000"}},{"$f":"'Einn._Ausg.'!G7","v":{"v":5000,"d":"5,000"}}]
[null,null,"Zustiftungen",{"$f":"$D$31","v":"EUR "},0,{"$f":"'Einn._Ausg.'!C8","v":0},{"$f":"'Einn._Ausg.'!D8","v":0},{"$f":"'Einn._Ausg.'!E8","v":0},{"$f":"'Einn._Ausg.'!F8","v":0},{"$f":"'Einn._Ausg.'!G8","v":0}]
[null,"Ordtl. Erträge","Mieterträge (brutto)","EUR ",0,{"$f":"'Daten Projektion'!I50","v":{"v":10000,"d":"10,000"}},{"$f":"'Daten Projektion'!J50","v":{"v":10100,"d":"10,100"}},{"$f":"'Daten Projektion'!K50","v":{"v":10201,"d":"10,201"}},{"$f":"'Daten Projektion'!L50","v":{"v":10303.01,"d":"10,303"}},{"$f":"'Daten Projektion'!M50","v":{"v":10406.0401,"d":"10,406"}}]
[null,null,"Erträge aus Beteiligungen","EUR ",0,{"$f":"'Daten Projektion'!I51","v":0},{"$f":"'Daten Projektion'!J51","v":0},{"$f":"'Daten Projektion'!K51","v":0},{"$f":"'Daten Projektion'!L51","v":0},{"$f":"'Daten Projektion'!M51","v":0}]
[null,null,"Wertpapiererträge (brutto)","EUR ",0,{"$f":"'Daten Projektion'!I52","v":{"v":48500,"d":"48,500"}},{"$f":"'Daten Projektion'!J52","v":{"v":49148.75,"d":"49,149"}},{"$f":"'Daten Projektion'!K52","v":{"v":49812.93125,"d":"49,813"}},{"$f":"'Daten Projektion'!L52","v":{"v":50492.986531250004,"d":"50,493"}},{"$f":"'Daten Projektion'!M52","v":{"v":51189.37180765626,"d":"51,189"}}]
[null,null,"Zinsen und ähnliche Erträge","EUR ",0,{"$f":"'Daten Projektion'!I57","v":0},{"$f":"'Daten Projektion'!J57","v":0},{"$f":"'Daten Projektion'!K57","v":0},{"$f":"'Daten Projektion'!L57","v":0},{"$f":"'Daten Projektion'!M57","v":0}]
[null,null,"Erträge aus sonstigem Vermögen","EUR ",0,{"$f":"'Daten Projektion'!I59","v":0},{"$f":"'Daten Projektion'!J59","v":0},{"$f":"'Daten Projektion'!K59","v":0},{"$f":"'Daten Projektion'!L59","v":0},{"$f":"'Daten Projektion'!M59","v":0}]
[null,null,"Ausgaben","EUR ",0,{"$f":"SUM(F40:F42)+SUM(F46:F50)","v":{"v":63500,"d":"63,500"}},{"$f":"SUM(G40:G42)+SUM(G46:G50)","v":{"v":64248.75,"d":"64,249"}},{"v":65013.93125,"d":"65,014"},{"v":65795.99653125,"d":"65,796"},{"v":66595.41190765626,"d":"66,595"}]
[null,null,"Ausgaben für den Stiftungszweck","EUR ",0,{"$f":"IF(Anlageziele!$M$5=\"Zielausschüttung\",Anlageziele!$M$7,'Zahlen Worst Case'!F31-SUM('Zahlen Worst Case'!F41:F42)-SUM('Zahlen Worst Case'!F46:F50))","v":{"v":7.275957614183426e-12,"d":"0"}},{"$f":"IF(Anlageziele!$M$5=\"Zielausschüttung\",Anlageziele!$M$7,'Zahlen Worst Case'!G31-SUM('Zahlen Worst Case'!G41:G42)-SUM('Zahlen Worst Case'!G46:G50))","v":{"v":7.275957614183426e-12,"d":"0"}},{"$f":"IF(Anlageziele!$M$5=\"Zielausschüttung\",Anlageziele!$M$7,'Zahlen Worst Case'!H31-SUM('Zahlen Worst Case'!H41:H42)-SUM('Zahlen Worst Case'!H46:H50))","v":0},{"$f":"IF(Anlageziele!$M$5=\"Zielausschüttung\",Anlageziele!$M$7,'Zahlen Worst Case'!I31-SUM('Zahlen Worst Case'!I41:I42)-SUM('Zahlen Worst Case'!I46:I50))","v":{"v":3.637978807091713E-12,"d":"0"}},{"$f":"IF(Anlageziele!$M$5=\"Zielausschüttung\",Anlageziele!$M$7,'Zahlen Worst Case'!J31-SUM('Zahlen Worst Case'!J41:J42)-SUM('Zahlen Worst Case'!J46:J50))","v":{"v":-3.637978807091713E-12,"d":"-0 "}}]
[null,null,"Allg. Verwaltungskosten","EUR ",0,{"$f":"'Einn._Ausg.'!C28","v":{"v":28000,"d":"28,000"}},{"$f":"'Einn._Ausg.'!D28","v":{"v":27030,"d":"27,030"}},{"$f":"'Einn._Ausg.'!E28","v":{"v":27570.600000000002,"d":"27,571"}},{"$f":"'Einn._Ausg.'!F28","v":{"v":28122.012,"d":"28,122"}},{"$f":"'Einn._Ausg.'!G28","v":{"v":28684.452240000002,"d":"28,684"}}]
[null,null,"Kosten Vermögensverwaltung","EUR ",0,{"$f":"SUM(F43:F45)","v":{"v":11220,"d":"11,220"}},{"$f":"SUM(G43:G45)","v":{"v":11444.4,"d":"11,444"}},{"v":11673.288,"d":"11,673"},{"v":11906.75376,"d":"11,907"},{"v":12144.8888352,"d":"12,145"}]
[null,null," davon Immobilien","EUR ",0,{"$f":"'Daten Projektion'!I80","v":{"v":5100,"d":"5,100"}},{"$f":"'Daten Projektion'!J80","v":{"v":5202,"d":"5,202"}},{"$f":"'Daten Projektion'!K80","v":{"v":5306.04,"d":"5,306"}},{"$f":"'Daten Projektion'!L80","v":{"v":5412.1608,"d":"5,412"}},{"$f":"'Daten Projektion'!M80","v":{"v":5520.4040159999995,"d":"5,520"}}]
[null,null," davon Beteiligungen","EUR ",0,{"$f":"'Daten Projektion'!I81","v":0},{"$f":"'Daten Projektion'!J81","v":0},{"$f":"'Daten Projektion'!K81","v":0},{"$f":"'Daten Projektion'!L81","v":0},{"$f":"'Daten Projektion'!M81","v":0}]
[null,null," davon Wertpapiere","EUR ",0,{"$f":"'Daten Projektion'!I82","v":{"v":6120,"d":"6,120"}},{"$f":"'Daten Projektion'!J82","v":{"v":6242.4,"d":"6,242"}},{"$f":"'Daten Projektion'!K82","v":{"v":6367.248,"d":"6,367"}},{"$f":"'Daten Projektion'!L82","v":{"v":6494.59296,"d":"6,495"}},{"$f":"'Daten Projektion'!M82","v":{"v":6624.4848192,"d":"6,624"}}]
[null,null,"Sollzinsen","EUR ",0,{"$f":"'Daten Projektion'!I60*-1","v":0},{"$f":"'Daten Projektion'!J60*-1","v":0},{"$f":"'Daten Projektion'!K60*-1","v":0},{"$f":"'Daten Projektion'!L60*-1","v":0},{"$f":"'Daten Projektion'!M60*-1","v":0}]
[null,null,"Tilgung","EUR ",0,{"$f":"(E17-F17)*-1","v":0},{"$f":"(F17-G17)*-1","v":0},{"$f":"(G17-H17)*-1","v":0},{"$f":"(H17-I17)*-1","v":0},{"$f":"(I17-J17)*-1","v":0}," "]
[null,null,"Sonstige Aufwände","EUR ",0,{"$f":"'Einn._Ausg.'!C27","v":{"v":3000,"d":"3,000"}},{"$f":"'Einn._Ausg.'!D27","v":{"v":3060,"d":"3,060"}},{"$f":"'Einn._Ausg.'!E27","v":{"v":3121.2,"d":"3,121"}},{"$f":"'Einn._Ausg.'!F27","v":{"v":3183.624,"d":"3,184"}},{"$f":"'Einn._Ausg.'!G27","v":{"v":3247.29648,"d":"3,247"}}]
[null,null,"Zuführung Freie Rücklage","EUR ",0,{"$f":"IF(Anlageziele!$M$5=\"Zielausschüttung\",'Zahlen Worst Case'!F31-SUM('Zahlen Worst Case'!F40:F42)-SUM('Zahlen Worst Case'!F46:F48)-'Zahlen Worst Case'!F50,(SUM(F34:F38)-F42)*Einstellungen!$D$30%+F31-F41-F42-F46-F47-F48-(SUM(F34:F38)-F42)*Einstellungen!$D$30%-F50)","v":{"v":21279.999999999993,"d":"21,280"}},{"$f":"IF(Anlageziele!$M$5=\"Zielausschüttung\",'Zahlen Worst Case'!G31-SUM('Zahlen Worst Case'!G40:G42)-SUM('Zahlen Worst Case'!G46:G48)-'Zahlen Worst Case'!G50,(SUM(G34:G38)-G42)*Einstellungen!$D$30%+G31-G41-G42-G46-G47-G48-(SUM(G34:G38)-G42)*Einstellungen!$D$30%-G50)","v":{"v":22714.34999999999,"d":"22,714"}},{"$f":"IF(Anlageziele!$M$5=\"Zielausschüttung\",'Zahlen Worst Case'!H31-SUM('Zahlen Worst Case'!H40:H42)-SUM('Zahlen Worst Case'!H46:H48)-'Zahlen Worst Case'!H50,(SUM(H34:H38)-H42)*Einstellungen!$D$30%+H31-H41-H42-H46-H47-H48-(SUM(H34:H38)-H42)*Einstellungen!$D$30%-H50)","v":{"v":22648.843249999994,"d":"22,649"}},{"$f":"IF(Anlageziele!$M$5=\"Zielausschüttung\",'Zahlen Worst Case'!I31-SUM('Zahlen Worst Case'!I40:I42)-SUM('Zahlen Worst Case'!I46:I48)-'Zahlen Worst Case'!I50,(SUM(I34:I38)-I42)*Einstellungen!$D$30%+I31-I41-I42-I46-I47-I48-(SUM(I34:I38)-I42)*Einstellungen!$D$30%-I50)","v":{"v":22583.60677125,"d":"22,584"}},{"$f":"IF(Anlageziele!$M$5=\"Zielausschüttung\",'Zahlen Worst Case'!J31-SUM('Zahlen Worst Case'!J40:J42)-SUM('Zahlen Worst Case'!J46:J48)-'Zahlen Worst Case'!J50,(SUM(J34:J38)-J42)*Einstellungen!$D$30%+J31-J41-J42-J46-J47-J48-(SUM(J34:J38)-J42)*Einstellungen!$D$30%-J50)","v":{"v":22518.77435245626,"d":"22,519"}}]
[null,null,"Neuanlage","EUR ",{"$f":"E33","v":0},{"$f":"F33","v":0},{"$f":"G33","v":0},0,0,0]
[null,null,"Kennzahlen",null," "]
[null,null,"Ausschüttungsrendite brutto","%",{"v":0,"d":"0.0%"},{"$f":"SUM(F34:F38)/E6","v":{"v":0.007697368421052632,"d":"0.8%"}},{"$f":"SUM(G34:G38)/F6","v":{"v":0.007743163328650309,"d":"0.8%"}},{"$f":"SUM(H34:H38)/G6","v":{"v":0.008662143852027192,"d":"0.9%"}},{"$f":"SUM(I34:I38)/H6","v":{"v":0.00871979388825544,"d":"0.9%"}},{"$f":"SUM(J34:J38)/I6","v":{"v":0.008778449776993763,"d":"0.9%"}}]
[null,null,"Verwaltungskostenquote (Aufsicht)","%",{"v":0,"d":"0.0%"},{"$f":"(F41+F42)/(F31-F33)","v":{"v":0.6176377952755906,"d":"61.8%"}},{"$f":"(G41+G42)/(G31-G33)","v":{"v":0.5988349967898209,"d":"59.9%"}},{"v":0.6036227504701157,"d":"60.4%"},{"v":0.6083769206381457,"d":"60.8%"},{"v":0.6130954056086555,"d":"61.3%"}]
[null,null,"Verwaltungskostenquote (Finanzamt)","%",{"v":0,"d":"0.0%"},{"$f":"F41/(F31-F42-F33)","v":{"v":0.5355776587605203,"d":"53.6%"}},{"$f":"G41/(G31-G42-G33)","v":{"v":0.511889645455346,"d":"51.2%"}},{"v":0.5168779062295992,"d":"51.7%"},{"v":0.5218483421519358,"d":"52.2%"},{"v":0.5267984699032212,"d":"52.7%"}]
[null,null,"Zweckeffizienz der Erträge","%",{"v":0,"d":"0.0%"},{"$f":"F40/(F31-F33)","v":{"v":1.1458200967217994E-16,"d":"0.0%"}},{"$f":"G40/(G31-G33)","v":{"v":1.1324667972814142E-16,"d":"0.0%"}},{"v":0,"d":"0.0%"},{"v":5.529179583690695e-17,"d":"0.0%"},{"v":-5.4628069755560234E-17,"d":"-0.0%"}]
[null,null,"Zweckeffizienz des Vermögens","%",{"$f":"E40/E6","v":{"v":0,"d":"0.0%"}},{"v":9.508880470720326e-19,"d":"0.0%"},{"v":1.050179353403205E-18,"d":"0.0%"},{"v":0,"d":"0.0%"},{"v":5.184771602096014e-19,"d":"0.0%"},{"v":-5.151667163197966e-19,"d":"-0.0%"}]

{"sheet":"Daten Umschichtung","index":17,"n_rows":194,"n_cols":13,"rows_kept":194,"hidden":true}
["Daten Umschichtung"]
[]
[null,"Nr.","Vermögensgegenstand","Umschichtung gegen","Wert",{"$f":"Einstellungen!D7","v":2019},{"$f":"F3+1","v":2020},{"$f":"G3+1","v":2021},2022,2023,null,"Beschlussfassung","Informationsgrundlagen"]
[null,1,{"$f":"Vermentw.!C5","v":"Vermögensverwaltung A-Bank Aktien"},{"$f":"Vermentw.!E5","v":"Aktien"},{"$f":"'Daten Projektion'!H6","v":{"v":650000,"d":"650,000"}},{"$f":"(SUMIFS(Umschichtung!$H$6:$H$11,Umschichtung!$E$6:$E$11,'Daten Umschichtung'!$C4,Umschichtung!$G$6:$G$11,'Daten Umschichtung'!F$3)+SUMIFS(Umschichtung!$J$6:$J$11,Umschichtung!$E$6:$E$11,'Daten Umschichtung'!$C4,Umschichtung!$G$6:$G$11,'Daten Umschichtung'!F$3))*-1","v":0},{"$f":"(SUMIFS(Umschichtung!$H$6:$H$11,Umschichtung!$E$6:$E$11,'Daten Umschichtung'!$C4,Umschichtung!$G$6:$G$11,'Daten Umschichtung'!G$3)+SUMIFS(Umschichtung!$J$6:$J$11,Umschichtung!$E$6:$E$11,'Daten Umschichtung'!$C4,Umschichtung!$G$6:$G$11,'Daten Umschichtung'!G$3))*-1","v":0},{"$f":"(SUMIFS(Umschichtung!$H$6:$H$11,Umschichtung!$E$6:$E$11,'Daten Umschichtung'!$C4,Umschichtung!$G$6:$G$11,'Daten Umschichtung'!H$3)+SUMIFS(Umschichtung!$J$6:$J$11,Umschichtung!$E$6:$E$11,'Daten Umschichtung'!$C4,Umschichtung!$G$6:$G$11,'Daten Umschichtung'!H$3))*-1","v":0},{"$f":"(SUMIFS(Umschichtung!$H$6:$H$11,Umschichtung!$E$6:$E$11,'Daten Umschichtung'!$C4,Umschichtung!$G$6:$G$11,'Daten Umschichtung'!I$3)+SUMIFS(Umschichtung!$J$6:$J$11,Umschichtung!$E$6:$E$11,'Daten Umschichtung'!$C4,Umschichtung!$G$6:$G$11,'Daten Umschichtung'!I$3))*-1","v":0},{"$f":"(SUMIFS(Umschichtung!$H$6:$H$11,Umschichtung!$E$6:$E$11,'Daten Umschichtung'!$C4,Umschichtung!$G$6:$G$11,'Daten Umschichtung'!J$3)+SUMIFS(Umschichtung!$J$6:$J$11,Umschichtung!$E$6:$E$11,'Daten Umschichtung'!$C4,Umschichtung!$G$6:$G$11,'Daten Umschichtung'!J$3))*-1","v":0},null,"Bitte auswählen","Bitte auswählen"]
[null,{"$f":"B4+1","v":2},{"$f":"Vermentw.!C6","v":"Vermögensverwaltung A-Bank Renten"},{"$f":"Vermentw.!E6","v":"Renten"},{"$f":"'Daten Projektion'!H7","v":{"v":5200000,"d":"5,200,000"}},{"$f":"(SUMIFS(Umschichtung!$H$6:$H$11,Umschichtung!$E$6:$E$11,'Daten Umschichtung'!$C5,Umschichtung!$G$6:$G$11,'Daten Umschichtung'!F$3)+SUMIFS(Umschichtung!$J$6:$J$11,Umschichtung!$E$6:$E$11,'Daten Umschichtung'!$C5,Umschichtung!$G$6:$G$11,'Daten Umschichtung'!F$3))*-1","v":0},{"$f":"(SUMIFS(Umschichtung!$H$6:$H$11,Umschichtung!$E$6:$E$11,'Daten Umschichtung'!$C5,Umschichtung!$G$6:$G$11,'Daten Umschichtung'!G$3)+SUMIFS(Umschichtung!$J$6:$J$11,Umschichtung!$E$6:$E$11,'Daten Umschichtung'!$C5,Umschichtung!$G$6:$G$11,'Daten Umschichtung'!G$3))*-1","v":0},{"$f":"(SUMIFS(Umschichtung!$H$6:$H$11,Umschichtung!$E$6:$E$11,'Daten Umschichtung'!$C5,Umschichtung!$G$6:$G$11,'Daten Umschichtung'!H$3)+SUMIFS(Umschichtung!$J$6:$J$11,Umschichtung!$E$6:$E$11,'Daten Umschichtung'!$C5,Umschichtung!$G$6:$G$11,'Daten Umschichtung'!H$3))*-1","v":0},{"$f":"(SUMIFS(Umschichtung!$H$6:$H$11,Umschichtung!$E$6:$E$11,'Daten Umschichtung'!$C5,Umschichtung!$G$6:$G$11,'Daten Umschichtung'!I$3)+SUMIFS(Umschichtung!$J$6:$J$11,Umschichtung!$E$6:$E$11,'Daten Umschichtung'!$C5,Umschichtung!$G$6:$G$11,'Daten Umschichtung'!I$3))*-1","v":0},{"$f":"(SUMIFS(Umschichtung!$H$6:$H$11,Umschichtung!$E$6:$E$11,'Daten Umschichtung'!$C5,Umschichtung!$G$6:$G$11,'Daten Umschichtung'!J$3)+SUMIFS(Umschichtung!$J$6:$J$11,Umschichtung!$E$6:$E$11,'Daten Umschichtung'!$C5,Umschichtung!$G$6:$G$11,'Daten Umschichtung'!J$3))*-1","v":0},null,"in persönlicher Abstimmung","Beratungsgespräch"]
[null,{"$f":"B5+1","v":3},{"$f":"Vermentw.!C7","v":"Stiftungsfonds Xy"},{"$f":"Vermentw.!E7","v":"Renten"},{"$f":"'Daten Projektion'!H8","v":{"v":250000,"d":"250,000"}},{"$f":"(SUMIFS(Umschichtung!$H$6:$H$11,Umschichtung!$E$6:$E$11,'Daten Umschichtung'!$C6,Umschichtung!$G$6:$G$11,'Daten Umschichtung'!F$3)+SUMIFS(Umschichtung!$J$6:$J$11,Umschichtung!$E$6:$E$11,'Daten Umschichtung'!$C6,Umschichtung!$G$6:$G$11,'Daten Umschichtung'!F$3))*-1","v":0},{"$f":"(SUMIFS(Umschichtung!$H$6:$H$11,Umschichtung!$E$6:$E$11,'Daten Umschichtung'!$C6,Umschichtung!$G$6:$G$11,'Daten Umschichtung'!G$3)+SUMIFS(Umschichtung!$J$6:$J$11,Umschichtung!$E$6:$E$11,'Daten Umschichtung'!$C6,Umschichtung!$G$6:$G$11,'Daten Umschichtung'!G$3))*-1","v":0},{"$f":"(SUMIFS(Umschichtung!$H$6:$H$11,Umschichtung!$E$6:$E$11,'Daten Umschichtung'!$C6,Umschichtung!$G$6:$G$11,'Daten Umschichtung'!H$3)+SUMIFS(Umschichtung!$J$6:$J$11,Umschichtung!$E$6:$E$11,'Daten Umschichtung'!$C6,Umschichtung!$G$6:$G$11,'Daten Umschichtung'!H$3))*-1","v":0},{"$f":"(SUMIFS(Umschichtung!$H$6:$H$11,Umschichtung!$E$6:$E$11,'Daten Umschichtung'!$C6,Umschichtung!$G$6:$G$11,'Daten Umschichtung'!I$3)+SUMIFS(Umschichtung!$J$6:$J$11,Umschichtung!$E$6:$E$11,'Daten Umschichtung'!$C6,Umschichtung!$G$6:$G$11,'Daten Umschichtung'!I$3))*-1","v":0},{"$f":"(SUMIFS(Umschichtung!$H$6:$H$11,Umschichtung!$E$6:$E$11,'Daten Umschichtung'!$C6,Umschichtung!$G$6:$G$11,'Daten Umschichtung'!J$3)+SUMIFS(Umschichtung!$J$6:$J$11,Umschichtung!$E$6:$E$11,'Daten Umschichtung'!$C6,Umschichtung!$G$6:$G$11,'Daten Umschichtung'!J$3))*-1","v":0},null,"im Umlaufverfahren","Geeignetheitserklärung"]
[null,4,{"$f":"Vermentw.!C8","v":"Immobilie"},{"$f":"Vermentw.!E8","v":"Immobilien"},{"$f":"'Daten Projektion'!H9","v":{"v":500000,"d":"500,000"}},{"$f":"(SUMIFS(Umschichtung!$H$6:$H$11,Umschichtung!$E$6:$E$11,'Daten Umschichtung'!$C7,Umschichtung!$G$6:$G$11,'Daten Umschichtung'!F$3)+SUMIFS(Umschichtung!$J$6:$J$11,Umschichtung!$E$6:$E$11,'Daten Umschichtung'!$C7,Umschichtung!$G$6:$G$11,'Daten Umschichtung'!F$3))*-1","v":0},{"$f":"(SUMIFS(Umschichtung!$H$6:$H$11,Umschichtung!$E$6:$E$11,'Daten Umschichtung'!$C7,Umschichtung!$G$6:$G$11,'Daten Umschichtung'!G$3)+SUMIFS(Umschichtung!$J$6:$J$11,Umschichtung!$E$6:$E$11,'Daten Umschichtung'!$C7,Umschichtung!$G$6:$G$11,'Daten Umschichtung'!G$3))*-1","v":0},{"$f":"(SUMIFS(Umschichtung!$H$6:$H$11,Umschichtung!$E$6:$E$11,'Daten Umschichtung'!$C7,Umschichtung!$G$6:$G$11,'Daten Umschichtung'!H$3)+SUMIFS(Umschichtung!$J$6:$J$11,Umschichtung!$E$6:$E$11,'Daten Umschichtung'!$C7,Umschichtung!$G$6:$G$11,'Daten Umschichtung'!H$3))*-1","v":0},{"$f":"(SUMIFS(Umschichtung!$H$6:$H$11,Umschichtung!$E$6:$E$11,'Daten Umschichtung'!$C7,Umschichtung!$G$6:$G$11,'Daten Umschichtung'!I$3)+SUMIFS(Umschichtung!$J$6:$J$11,Umschichtung!$E$6:$E$11,'Daten Umschichtung'!$C7,Umschichtung!$G$6:$G$11,'Daten Umschichtung'!I$3))*-1","v":0},{"$f":"(SUMIFS(Umschichtung!$H$6:$H$11,Umschichtung!$E$6:$E$11,'Daten Umschichtung'!$C7,Umschichtung!$G$6:$G$11,'Daten Umschichtung'!J$3)+SUMIFS(Umschichtung!$J$6:$J$11,Umschichtung!$E$6:$E$11,'Daten Umschichtung'!$C7,Umschichtung!$G$6:$G$11,'Daten Umschichtung'!J$3))*-1","v":0},null,null,"Produktinformationsblatt"]
[null,5,{"$f":"Vermentw.!C9","v":"Bankguthaben B-Bank"},{"$f":"Vermentw.!E9","v":"Kontoguthaben"},{"$f":"'Daten Projektion'!H10","v":{"v":1000000,"d":"1,000,000"}},{"$f":"(SUMIFS(Umschichtung!$H$6:$H$11,Umschichtung!$E$6:$E$11,'Daten Umschichtung'!$C8,Umschichtung!$G$6:$G$11,'Daten Umschichtung'!F$3)+SUMIFS(Umschichtung!$J$6:$J$11,Umschichtung!$E$6:$E$11,'Daten Umschichtung'!$C8,Umschichtung!$G$6:$G$11,'Daten Umschichtung'!F$3))*-1","v":{"v":-500000,"d":"-500,000 "}},{"$f":"(SUMIFS(Umschichtung!$H$6:$H$11,Umschichtung!$E$6:$E$11,'Daten Umschichtung'!$C8,Umschichtung!$G$6:$G$11,'Daten Umschichtung'!G$3)+SUMIFS(Umschichtung!$J$6:$J$11,Umschichtung!$E$6:$E$11,'Daten Umschichtung'!$C8,Umschichtung!$G$6:$G$11,'Daten Umschichtung'!G$3))*-1","v":{"v":-500000,"d":"-500,000 "}},{"$f":"(SUMIFS(Umschichtung!$H$6:$H$11,Umschichtung!$E$6:$E$11,'Daten Umschichtung'!$C8,Umschichtung!$G$6:$G$11,'Daten Umschichtung'!H$3)+SUMIFS(Umschichtung!$J$6:$J$11,Umschichtung!$E$6:$E$11,'Daten Umschichtung'!$C8,Umschichtung!$G$6:$G$11,'Daten Umschichtung'!H$3))*-1","v":0},{"$f":"(SUMIFS(Umschichtung!$H$6:$H$11,Umschichtung!$E$6:$E$11,'Daten Umschichtung'!$C8,Umschichtung!$G$6:$G$11,'Daten Umschichtung'!I$3)+SUMIFS(Umschichtung!$J$6:$J$11,Umschichtung!$E$6:$E$11,'Daten Umschichtung'!$C8,Umschichtung!$G$6:$G$11,'Daten Umschichtung'!I$3))*-1","v":0},{"$f":"(SUMIFS(Umschichtung!$H$6:$H$11,Umschichtung!$E$6:$E$11,'Daten Umschichtung'!$C8,Umschichtung!$G$6:$G$11,'Daten Umschichtung'!J$3)+SUMIFS(Umschichtung!$J$6:$J$11,Umschichtung!$E$6:$E$11,'Daten Umschichtung'!$C8,Umschichtung!$G$6:$G$11,'Daten Umschichtung'!J$3))*-1","v":0},null,null,"Verkaufsprospekt"]
[null,6,{"$f":"Vermentw.!C10","v":0},{"$f":"Vermentw.!E10","v":"Bitte auswählen"},{"$f":"'Daten Projektion'!H11","v":0},{"$f":"(SUMIFS(Umschichtung!$H$6:$H$11,Umschichtung!$E$6:$E$11,'Daten Umschichtung'!$C9,Umschichtung!$G$6:$G$11,'Daten Umschichtung'!F$3)+SUMIFS(Umschichtung!$J$6:$J$11,Umschichtung!$E$6:$E$11,'Daten Umschichtung'!$C9,Umschichtung!$G$6:$G$11,'Daten Umschichtung'!F$3))*-1","v":0},{"$f":"(SUMIFS(Umschichtung!$H$6:$H$11,Umschichtung!$E$6:$E$11,'Daten Umschichtung'!$C9,Umschichtung!$G$6:$G$11,'Daten Umschichtung'!G$3)+SUMIFS(Umschichtung!$J$6:$J$11,Umschichtung!$E$6:$E$11,'Daten Umschichtung'!$C9,Umschichtung!$G$6:$G$11,'Daten Umschichtung'!G$3))*-1","v":0},{"$f":"(SUMIFS(Umschichtung!$H$6:$H$11,Umschichtung!$E$6:$E$11,'Daten Umschichtung'!$C9,Umschichtung!$G$6:$G$11,'Daten Umschichtung'!H$3)+SUMIFS(Umschichtung!$J$6:$J$11,Umschichtung!$E$6:$E$11,'Daten Umschichtung'!$C9,Umschichtung!$G$6:$G$11,'Daten Umschichtung'!H$3))*-1","v":0},{"$f":"(SUMIFS(Umschichtung!$H$6:$H$11,Umschichtung!$E$6:$E$11,'Daten Umschichtung'!$C9,Umschichtung!$G$6:$G$11,'Daten Umschichtung'!I$3)+SUMIFS(Umschichtung!$J$6:$J$11,Umschichtung!$E$6:$E$11,'Daten Umschichtung'!$C9,Umschichtung!$G$6:$G$11,'Daten Umschichtung'!I$3))*-1","v":0},{"$f":"(SUMIFS(Umschichtung!$H$6:$H$11,Umschichtung!$E$6:$E$11,'Daten Umschichtung'!$C9,Umschichtung!$G$6:$G$11,'Daten Umschichtung'!J$3)+SUMIFS(Umschichtung!$J$6:$J$11,Umschichtung!$E$6:$E$11,'Daten Umschichtung'!$C9,Umschichtung!$G$6:$G$11,'Daten Umschichtung'!J$3))*-1","v":0},null,null,"Informationsveranstaltung vom"]
[null,7,{"$f":"Vermentw.!C11","v":0},{"$f":"Vermentw.!E11","v":"Bitte auswählen"},{"$f":"'Daten Projektion'!H12","v":0},{"$f":"(SUMIFS(Umschichtung!$H$6:$H$11,Umschichtung!$E$6:$E$11,'Daten Umschichtung'!$C10,Umschichtung!$G$6:$G$11,'Daten Umschichtung'!F$3)+SUMIFS(Umschichtung!$J$6:$J$11,Umschichtung!$E$6:$E$11,'Daten Umschichtung'!$C10,Umschichtung!$G$6:$G$11,'Daten Umschichtung'!F$3))*-1","v":0},{"$f":"(SUMIFS(Umschichtung!$H$6:$H$11,Umschichtung!$E$6:$E$11,'Daten Umschichtung'!$C10,Umschichtung!$G$6:$G$11,'Daten Umschichtung'!G$3)+SUMIFS(Umschichtung!$J$6:$J$11,Umschichtung!$E$6:$E$11,'Daten Umschichtung'!$C10,Umschichtung!$G$6:$G$11,'Daten Umschichtung'!G$3))*-1","v":0},{"$f":"(SUMIFS(Umschichtung!$H$6:$H$11,Umschichtung!$E$6:$E$11,'Daten Umschichtung'!$C10,Umschichtung!$G$6:$G$11,'Daten Umschichtung'!H$3)+SUMIFS(Umschichtung!$J$6:$J$11,Umschichtung!$E$6:$E$11,'Daten Umschichtung'!$C10,Umschichtung!$G$6:$G$11,'Daten Umschichtung'!H$3))*-1","v":0},{"$f":"(SUMIFS(Umschichtung!$H$6:$H$11,Umschichtung!$E$6:$E$11,'Daten Umschichtung'!$C10,Umschichtung!$G$6:$G$11,'Daten Umschichtung'!I$3)+SUMIFS(Umschichtung!$J$6:$J$11,Umschichtung!$E$6:$E$11,'Daten Umschichtung'!$C10,Umschichtung!$G$6:$G$11,'Daten Umschichtung'!I$3))*-1","v":0},{"$f":"(SUMIFS(Umschichtung!$H$6:$H$11,Umschichtung!$E$6:$E$11,'Daten Umschichtung'!$C10,Umschichtung!$G$6:$G$11,'Daten Umschichtung'!J$3)+SUMIFS(Umschichtung!$J$6:$J$11,Umschichtung!$E$6:$E$11,'Daten Umschichtung'!$C10,Umschichtung!$G$6:$G$11,'Daten Umschichtung'!J$3))*-1","v":0},null,null,"Presseartikel"]
[null,8,{"$f":"Vermentw.!C12","v":0},{"$f":"Vermentw.!E12","v":"Bitte auswählen"},{"$f":"'Daten Projektion'!H13","v":0},{"$f":"(SUMIFS(Umschichtung!$H$6:$H$11,Umschichtung!$E$6:$E$11,'Daten Umschichtung'!$C11,Umschichtung!$G$6:$G$11,'Daten Umschichtung'!F$3)+SUMIFS(Umschichtung!$J$6:$J$11,Umschichtung!$E$6:$E$11,'Daten Umschichtung'!$C11,Umschichtung!$G$6:$G$11,'Daten Umschichtung'!F$3))*-1","v":0},{"$f":"(SUMIFS(Umschichtung!$H$6:$H$11,Umschichtung!$E$6:$E$11,'Daten Umschichtung'!$C11,Umschichtung!$G$6:$G$11,'Daten Umschichtung'!G$3)+SUMIFS(Umschichtung!$J$6:$J$11,Umschichtung!$E$6:$E$11,'Daten Umschichtung'!$C11,Umschichtung!$G$6:$G$11,'Daten Umschichtung'!G$3))*-1","v":0},{"$f":"(SUMIFS(Umschichtung!$H$6:$H$11,Umschichtung!$E$6:$E$11,'Daten Umschichtung'!$C11,Umschichtung!$G$6:$G$11,'Daten Umschichtung'!H$3)+SUMIFS(Umschichtung!$J$6:$J$11,Umschichtung!$E$6:$E$11,'Daten Umschichtung'!$C11,Umschichtung!$G$6:$G$11,'Daten Umschichtung'!H$3))*-1","v":0},{"$f":"(SUMIFS(Umschichtung!$H$6:$H$11,Umschichtung!$E$6:$E$11,'Daten Umschichtung'!$C11,Umschichtung!$G$6:$G$11,'Daten Umschichtung'!I$3)+SUMIFS(Umschichtung!$J$6:$J$11,Umschichtung!$E$6:$E$11,'Daten Umschichtung'!$C11,Umschichtung!$G$6:$G$11,'Daten Umschichtung'!I$3))*-1","v":0},{"$f":"(SUMIFS(Umschichtung!$H$6:$H$11,Umschichtung!$E$6:$E$11,'Daten Umschichtung'!$C11,Umschichtung!$G$6:$G$11,'Daten Umschichtung'!J$3)+SUMIFS(Umschichtung!$J$6:$J$11,Umschichtung!$E$6:$E$11,'Daten Umschichtung'!$C11,Umschichtung!$G$6:$G$11,'Daten Umschichtung'!J$3))*-1","v":0},null,null,"Fachmedium"]
[null,9,{"$f":"Vermentw.!C13","v":0},{"$f":"Vermentw.!E13","v":"Bitte auswählen"},{"$f":"'Daten Projektion'!H14","v":0},{"$f":"(SUMIFS(Umschichtung!$H$6:$H$11,Umschichtung!$E$6:$E$11,'Daten Umschichtung'!$C12,Umschichtung!$G$6:$G$11,'Daten Umschichtung'!F$3)+SUMIFS(Umschichtung!$J$6:$J$11,Umschichtung!$E$6:$E$11,'Daten Umschichtung'!$C12,Umschichtung!$G$6:$G$11,'Daten Umschichtung'!F$3))*-1","v":0},{"$f":"(SUMIFS(Umschichtung!$H$6:$H$11,Umschichtung!$E$6:$E$11,'Daten Umschichtung'!$C12,Umschichtung!$G$6:$G$11,'Daten Umschichtung'!G$3)+SUMIFS(Umschichtung!$J$6:$J$11,Umschichtung!$E$6:$E$11,'Daten Umschichtung'!$C12,Umschichtung!$G$6:$G$11,'Daten Umschichtung'!G$3))*-1","v":0},{"$f":"(SUMIFS(Umschichtung!$H$6:$H$11,Umschichtung!$E$6:$E$11,'Daten Umschichtung'!$C12,Umschichtung!$G$6:$G$11,'Daten Umschichtung'!H$3)+SUMIFS(Umschichtung!$J$6:$J$11,Umschichtung!$E$6:$E$11,'Daten Umschichtung'!$C12,Umschichtung!$G$6:$G$11,'Daten Umschichtung'!H$3))*-1","v":0},{"$f":"(SUMIFS(Umschichtung!$H$6:$H$11,Umschichtung!$E$6:$E$11,'Daten Umschichtung'!$C12,Umschichtung!$G$6:$G$11,'Daten Umschichtung'!I$3)+SUMIFS(Umschichtung!$J$6:$J$11,Umschichtung!$E$6:$E$11,'Daten Umschichtung'!$C12,Umschichtung!$G$6:$G$11,'Daten Umschichtung'!I$3))*-1","v":0},{"$f":"(SUMIFS(Umschichtung!$H$6:$H$11,Umschichtung!$E$6:$E$11,'Daten Umschichtung'!$C12,Umschichtung!$G$6:$G$11,'Daten Umschichtung'!J$3)+SUMIFS(Umschichtung!$J$6:$J$11,Umschichtung!$E$6:$E$11,'Daten Umschichtung'!$C12,Umschichtung!$G$6:$G$11,'Daten Umschichtung'!J$3))*-1","v":0},null,null,"Sonstiges"]
[null,10,{"$f":"Vermentw.!C14","v":0},{"$f":"Vermentw.!E14","v":"Bitte auswählen"},{"$f":"'Daten Projektion'!H15","v":0},{"$f":"(SUMIFS(Umschichtung!$H$6:$H$11,Umschichtung!$E$6:$E$11,'Daten Umschichtung'!$C13,Umschichtung!$G$6:$G$11,'Daten Umschichtung'!F$3)+SUMIFS(Umschichtung!$J$6:$J$11,Umschichtung!$E$6:$E$11,'Daten Umschichtung'!$C13,Umschichtung!$G$6:$G$11,'Daten Umschichtung'!F$3))*-1","v":0},{"$f":"(SUMIFS(Umschichtung!$H$6:$H$11,Umschichtung!$E$6:$E$11,'Daten Umschichtung'!$C13,Umschichtung!$G$6:$G$11,'Daten Umschichtung'!G$3)+SUMIFS(Umschichtung!$J$6:$J$11,Umschichtung!$E$6:$E$11,'Daten Umschichtung'!$C13,Umschichtung!$G$6:$G$11,'Daten Umschichtung'!G$3))*-1","v":0},{"$f":"(SUMIFS(Umschichtung!$H$6:$H$11,Umschichtung!$E$6:$E$11,'Daten Umschichtung'!$C13,Umschichtung!$G$6:$G$11,'Daten Umschichtung'!H$3)+SUMIFS(Umschichtung!$J$6:$J$11,Umschichtung!$E$6:$E$11,'Daten Umschichtung'!$C13,Umschichtung!$G$6:$G$11,'Daten Umschichtung'!H$3))*-1","v":0},{"$f":"(SUMIFS(Umschichtung!$H$6:$H$11,Umschichtung!$E$6:$E$11,'Daten Umschichtung'!$C13,Umschichtung!$G$6:$G$11,'Daten Umschichtung'!I$3)+SUMIFS(Umschichtung!$J$6:$J$11,Umschichtung!$E$6:$E$11,'Daten Umschichtung'!$C13,Umschichtung!$G$6:$G$11,'Daten Umschichtung'!I$3))*-1","v":0},{"$f":"(SUMIFS(Umschichtung!$H$6:$H$11,Umschichtung!$E$6:$E$11,'Daten Umschichtung'!$C13,Umschichtung!$G$6:$G$11,'Daten Umschichtung'!J$3)+SUMIFS(Umschichtung!$J$6:$J$11,Umschichtung!$E$6:$E$11,'Daten Umschichtung'!$C13,Umschichtung!$G$6:$G$11,'Daten Umschichtung'!J$3))*-1","v":0}]
[null,11,{"$f":"Vermentw.!C15","v":0},{"$f":"Vermentw.!E15","v":"Bitte auswählen"},{"$f":"'Daten Projektion'!H16","v":0},{"$f":"(SUMIFS(Umschichtung!$H$6:$H$11,Umschichtung!$E$6:$E$11,'Daten Umschichtung'!$C14,Umschichtung!$G$6:$G$11,'Daten Umschichtung'!F$3)+SUMIFS(Umschichtung!$J$6:$J$11,Umschichtung!$E$6:$E$11,'Daten Umschichtung'!$C14,Umschichtung!$G$6:$G$11,'Daten Umschichtung'!F$3))*-1","v":0},{"$f":"(SUMIFS(Umschichtung!$H$6:$H$11,Umschichtung!$E$6:$E$11,'Daten Umschichtung'!$C14,Umschichtung!$G$6:$G$11,'Daten Umschichtung'!G$3)+SUMIFS(Umschichtung!$J$6:$J$11,Umschichtung!$E$6:$E$11,'Daten Umschichtung'!$C14,Umschichtung!$G$6:$G$11,'Daten Umschichtung'!G$3))*-1","v":0},{"$f":"(SUMIFS(Umschichtung!$H$6:$H$11,Umschichtung!$E$6:$E$11,'Daten Umschichtung'!$C14,Umschichtung!$G$6:$G$11,'Daten Umschichtung'!H$3)+SUMIFS(Umschichtung!$J$6:$J$11,Umschichtung!$E$6:$E$11,'Daten Umschichtung'!$C14,Umschichtung!$G$6:$G$11,'Daten Umschichtung'!H$3))*-1","v":0},{"$f":"(SUMIFS(Umschichtung!$H$6:$H$11,Umschichtung!$E$6:$E$11,'Daten Umschichtung'!$C14,Umschichtung!$G$6:$G$11,'Daten Umschichtung'!I$3)+SUMIFS(Umschichtung!$J$6:$J$11,Umschichtung!$E$6:$E$11,'Daten Umschichtung'!$C14,Umschichtung!$G$6:$G$11,'Daten Umschichtung'!I$3))*-1","v":0},{"$f":"(SUMIFS(Umschichtung!$H$6:$H$11,Umschichtung!$E$6:$E$11,'Daten Umschichtung'!$C14,Umschichtung!$G$6:$G$11,'Daten Umschichtung'!J$3)+SUMIFS(Umschichtung!$J$6:$J$11,Umschichtung!$E$6:$E$11,'Daten Umschichtung'!$C14,Umschichtung!$G$6:$G$11,'Daten Umschichtung'!J$3))*-1","v":0}]
[null,12,{"$f":"Vermentw.!C16","v":0},{"$f":"Vermentw.!E16","v":"Bitte auswählen"},{"$f":"'Daten Projektion'!H17","v":0},{"$f":"(SUMIFS(Umschichtung!$H$6:$H$11,Umschichtung!$E$6:$E$11,'Daten Umschichtung'!$C15,Umschichtung!$G$6:$G$11,'Daten Umschichtung'!F$3)+SUMIFS(Umschichtung!$J$6:$J$11,Umschichtung!$E$6:$E$11,'Daten Umschichtung'!$C15,Umschichtung!$G$6:$G$11,'Daten Umschichtung'!F$3))*-1","v":0},{"$f":"(SUMIFS(Umschichtung!$H$6:$H$11,Umschichtung!$E$6:$E$11,'Daten Umschichtung'!$C15,Umschichtung!$G$6:$G$11,'Daten Umschichtung'!G$3)+SUMIFS(Umschichtung!$J$6:$J$11,Umschichtung!$E$6:$E$11,'Daten Umschichtung'!$C15,Umschichtung!$G$6:$G$11,'Daten Umschichtung'!G$3))*-1","v":0},{"$f":"(SUMIFS(Umschichtung!$H$6:$H$11,Umschichtung!$E$6:$E$11,'Daten Umschichtung'!$C15,Umschichtung!$G$6:$G$11,'Daten Umschichtung'!H$3)+SUMIFS(Umschichtung!$J$6:$J$11,Umschichtung!$E$6:$E$11,'Daten Umschichtung'!$C15,Umschichtung!$G$6:$G$11,'Daten Umschichtung'!H$3))*-1","v":0},{"$f":"(SUMIFS(Umschichtung!$H$6:$H$11,Umschichtung!$E$6:$E$11,'Daten Umschichtung'!$C15,Umschichtung!$G$6:$G$11,'Daten Umschichtung'!I$3)+SUMIFS(Umschichtung!$J$6:$J$11,Umschichtung!$E$6:$E$11,'Daten Umschichtung'!$C15,Umschichtung!$G$6:$G$11,'Daten Umschichtung'!I$3))*-1","v":0},{"$f":"(SUMIFS(Umschichtung!$H$6:$H$11,Umschichtung!$E$6:$E$11,'Daten Umschichtung'!$C15,Umschichtung!$G$6:$G$11,'Daten Umschichtung'!J$3)+SUMIFS(Umschichtung!$J$6:$J$11,Umschichtung!$E$6:$E$11,'Daten Umschichtung'!$C15,Umschichtung!$G$6:$G$11,'Daten Umschichtung'!J$3))*-1","v":0}]
[null,{"$f":"Umschichtung!B6","v":"U1"},{"$f":"Umschichtung!C6","v":"Aufstockung VV Aktien"},{"$f":"Umschichtung!E6","v":"Bankguthaben B-Bank"},0,{"$f":"SUMIFS(Umschichtung!$H$6:$H$11,Umschichtung!$C$6:$C$11,'Daten Umschichtung'!$C16,Umschichtung!$G$6:$G$11,'Daten Umschichtung'!F$3)","v":0},{"$f":"SUMIFS(Umschichtung!$H$6:$H$11,Umschichtung!$C$6:$C$11,'Daten Umschichtung'!$C16,Umschichtung!$G$6:$G$11,'Daten Umschichtung'!G$3)","v":{"v":500000,"d":"500,000"}},{"$f":"SUMIFS(Umschichtung!$H$6:$H$11,Umschichtung!$C$6:$C$11,'Daten Umschichtung'!$C16,Umschichtung!$G$6:$G$11,'Daten Umschichtung'!H$3)","v":0},{"$f":"SUMIFS(Umschichtung!$H$6:$H$11,Umschichtung!$C$6:$C$11,'Daten Umschichtung'!$C16,Umschichtung!$G$6:$G$11,'Daten Umschichtung'!I$3)","v":0},{"$f":"SUMIFS(Umschichtung!$H$6:$H$11,Umschichtung!$C$6:$C$11,'Daten Umschichtung'!$C16,Umschichtung!$G$6:$G$11,'Daten Umschichtung'!J$3)","v":0}]
[null,{"$f":"Umschichtung!B7","v":"U2"},{"$f":"Umschichtung!C7","v":"ABC Stiftungsfonds"},{"$f":"Umschichtung!E7","v":"Bankguthaben B-Bank"},0,{"$f":"SUMIFS(Umschichtung!$H$6:$H$11,Umschichtung!$C$6:$C$11,'Daten Umschichtung'!$C17,Umschichtung!$G$6:$G$11,'Daten Umschichtung'!F$3)","v":{"v":500000,"d":"500,000"}},{"$f":"SUMIFS(Umschichtung!$H$6:$H$11,Umschichtung!$C$6:$C$11,'Daten Umschichtung'!$C17,Umschichtung!$G$6:$G$11,'Daten Umschichtung'!G$3)","v":0},{"$f":"SUMIFS(Umschichtung!$H$6:$H$11,Umschichtung!$C$6:$C$11,'Daten Umschichtung'!$C17,Umschichtung!$G$6:$G$11,'Daten Umschichtung'!H$3)","v":0},{"$f":"SUMIFS(Umschichtung!$H$6:$H$11,Umschichtung!$C$6:$C$11,'Daten Umschichtung'!$C17,Umschichtung!$G$6:$G$11,'Daten Umschichtung'!I$3)","v":0},{"$f":"SUMIFS(Umschichtung!$H$6:$H$11,Umschichtung!$C$6:$C$11,'Daten Umschichtung'!$C17,Umschichtung!$G$6:$G$11,'Daten Umschichtung'!J$3)","v":0}]
[null,{"$f":"Umschichtung!B8","v":"U3"},{"$f":"Umschichtung!C8","v":0},{"$f":"Umschichtung!E8","v":0},0,{"$f":"SUMIFS(Umschichtung!$H$6:$H$11,Umschichtung!$C$6:$C$11,'Daten Umschichtung'!$C18,Umschichtung!$G$6:$G$11,'Daten Umschichtung'!F$3)","v":0},{"$f":"SUMIFS(Umschichtung!$H$6:$H$11,Umschichtung!$C$6:$C$11,'Daten Umschichtung'!$C18,Umschichtung!$G$6:$G$11,'Daten Umschichtung'!G$3)","v":0},{"$f":"SUMIFS(Umschichtung!$H$6:$H$11,Umschichtung!$C$6:$C$11,'Daten Umschichtung'!$C18,Umschichtung!$G$6:$G$11,'Daten Umschichtung'!H$3)","v":0},{"$f":"SUMIFS(Umschichtung!$H$6:$H$11,Umschichtung!$C$6:$C$11,'Daten Umschichtung'!$C18,Umschichtung!$G$6:$G$11,'Daten Umschichtung'!I$3)","v":0},{"$f":"SUMIFS(Umschichtung!$H$6:$H$11,Umschichtung!$C$6:$C$11,'Daten Umschichtung'!$C18,Umschichtung!$G$6:$G$11,'Daten Umschichtung'!J$3)","v":0}]
[null,{"$f":"Umschichtung!B9","v":"U4"},{"$f":"Umschichtung!C9","v":0},{"$f":"Umschichtung!E9","v":0},0,{"$f":"SUMIFS(Umschichtung!$H$6:$H$11,Umschichtung!$C$6:$C$11,'Daten Umschichtung'!$C19,Umschichtung!$G$6:$G$11,'Daten Umschichtung'!F$3)","v":0},{"$f":"SUMIFS(Umschichtung!$H$6:$H$11,Umschichtung!$C$6:$C$11,'Daten Umschichtung'!$C19,Umschichtung!$G$6:$G$11,'Daten Umschichtung'!G$3)","v":0},{"$f":"SUMIFS(Umschichtung!$H$6:$H$11,Umschichtung!$C$6:$C$11,'Daten Umschichtung'!$C19,Umschichtung!$G$6:$G$11,'Daten Umschichtung'!H$3)","v":0},{"$f":"SUMIFS(Umschichtung!$H$6:$H$11,Umschichtung!$C$6:$C$11,'Daten Umschichtung'!$C19,Umschichtung!$G$6:$G$11,'Daten Umschichtung'!I$3)","v":0},{"$f":"SUMIFS(Umschichtung!$H$6:$H$11,Umschichtung!$C$6:$C$11,'Daten Umschichtung'!$C19,Umschichtung!$G$6:$G$11,'Daten Umschichtung'!J$3)","v":0}]
[null,{"$f":"Umschichtung!B10","v":"U5"},{"$f":"Umschichtung!C10","v":0},{"$f":"Umschichtung!E10","v":0},0,{"$f":"SUMIFS(Umschichtung!$H$6:$H$11,Umschichtung!$C$6:$C$11,'Daten Umschichtung'!$C20,Umschichtung!$G$6:$G$11,'Daten Umschichtung'!F$3)","v":0},{"$f":"SUMIFS(Umschichtung!$H$6:$H$11,Umschichtung!$C$6:$C$11,'Daten Umschichtung'!$C20,Umschichtung!$G$6:$G$11,'Daten Umschichtung'!G$3)","v":0},{"$f":"SUMIFS(Umschichtung!$H$6:$H$11,Umschichtung!$C$6:$C$11,'Daten Umschichtung'!$C20,Umschichtung!$G$6:$G$11,'Daten Umschichtung'!H$3)","v":0},{"$f":"SUMIFS(Umschichtung!$H$6:$H$11,Umschichtung!$C$6:$C$11,'Daten Umschichtung'!$C20,Umschichtung!$G$6:$G$11,'Daten Umschichtung'!I$3)","v":0},{"$f":"SUMIFS(Umschichtung!$H$6:$H$11,Umschichtung!$C$6:$C$11,'Daten Umschichtung'!$C20,Umschichtung!$G$6:$G$11,'Daten Umschichtung'!J$3)","v":0}]
[null,{"$f":"Umschichtung!B11","v":"U6"},{"$f":"Umschichtung!C11","v":0},{"$f":"Umschichtung!E11","v":0},0,{"$f":"SUMIFS(Umschichtung!$H$6:$H$11,Umschichtung!$C$6:$C$11,'Daten Umschichtung'!$C21,Umschichtung!$G$6:$G$11,'Daten Umschichtung'!F$3)","v":0},{"$f":"SUMIFS(Umschichtung!$H$6:$H$11,Umschichtung!$C$6:$C$11,'Daten Umschichtung'!$C21,Umschichtung!$G$6:$G$11,'Daten Umschichtung'!G$3)","v":0},{"$f":"SUMIFS(Umschichtung!$H$6:$H$11,Umschichtung!$C$6:$C$11,'Daten Umschichtung'!$C21,Umschichtung!$G$6:$G$11,'Daten Umschichtung'!H$3)","v":0},{"$f":"SUMIFS(Umschichtung!$H$6:$H$11,Umschichtung!$C$6:$C$11,'Daten Umschichtung'!$C21,Umschichtung!$G$6:$G$11,'Daten Umschichtung'!I$3)","v":0},{"$f":"SUMIFS(Umschichtung!$H$6:$H$11,Umschichtung!$C$6:$C$11,'Daten Umschichtung'!$C21,Umschichtung!$G$6:$G$11,'Daten Umschichtung'!J$3)","v":0}]
[null,null,"Summe",null,null,{"$f":"SUM(F4:F21)","v":0},0,0,0,0]
[]
[null,{"$f":"B3","v":"Nr."},{"$f":"C3","v":"Vermögensgegenstand"},"Anlageklasse",{"$f":"E3","v":"Wert"},{"$f":"F3","v":2019},{"$f":"G3","v":2020},2021,2022,2023]
[null,{"$f":"B4","v":1},"Vermögensverwaltung A-Bank Aktien","Aktien",{"v":650000,"d":"650,000"},{"$f":"E25+E25*Annahmen!$D7+'Daten Umschichtung'!F4","v":{"v":669500,"d":"669,500"}},{"$f":"F25+F25*Annahmen!$D7+'Daten Umschichtung'!G4","v":{"v":689585,"d":"689,585"}},{"$f":"G25+G25*Annahmen!$D7+'Daten Umschichtung'!H4","v":{"v":710272.55,"d":"710,273"}},{"$f":"H25+H25*Annahmen!$D7+'Daten Umschichtung'!I4","v":{"v":731580.7265000001,"d":"731,581"}},{"$f":"I25+I25*Annahmen!$D7+'Daten Umschichtung'!J4","v":{"v":753528.1482950001,"d":"753,528"}}]
[null,2,"Vermögensverwaltung A-Bank Renten","Renten",{"v":5200000,"d":"5,200,000"},{"$f":"E26+E26*Annahmen!$D8+'Daten Umschichtung'!F5","v":{"v":5226000,"d":"5,226,000"}},{"$f":"F26+F26*Annahmen!$D8+'Daten Umschichtung'!G5","v":{"v":5252130,"d":"5,252,130"}},{"$f":"G26+G26*Annahmen!$D8+'Daten Umschichtung'!H5","v":{"v":5278390.65,"d":"5,278,391"}},{"$f":"H26+H26*Annahmen!$D8+'Daten Umschichtung'!I5","v":{"v":5304782.603250001,"d":"5,304,783"}},{"$f":"I26+I26*Annahmen!$D8+'Daten Umschichtung'!J5","v":{"v":5331306.516266251,"d":"5,331,307"}}]
[null,3,"Stiftungsfonds Xy","Renten",{"v":250000,"d":"250,000"},{"$f":"E27+E27*Annahmen!$D9+'Daten Umschichtung'!F6","v":{"v":251250,"d":"251,250"}},{"$f":"F27+F27*Annahmen!$D9+'Daten Umschichtung'!G6","v":{"v":252506.25,"d":"252,506"}},{"$f":"G27+G27*Annahmen!$D9+'Daten Umschichtung'!H6","v":{"v":253768.78125,"d":"253,769"}},{"$f":"H27+H27*Annahmen!$D9+'Daten Umschichtung'!I6","v":{"v":255037.62515625,"d":"255,038"}},{"$f":"I27+I27*Annahmen!$D9+'Daten Umschichtung'!J6","v":{"v":256312.81328203125,"d":"256,313"}}]
[null,4,"Immobilie","Immobilien",{"v":500000,"d":"500,000"},{"$f":"E28+E28*Annahmen!$D10+'Daten Umschichtung'!F7","v":{"v":505000,"d":"505,000"}},{"$f":"F28+F28*Annahmen!$D10+'Daten Umschichtung'!G7","v":{"v":510050,"d":"510,050"}},{"$f":"G28+G28*Annahmen!$D10+'Daten Umschichtung'!H7","v":{"v":515150.5,"d":"515,151"}},{"$f":"H28+H28*Annahmen!$D10+'Daten Umschichtung'!I7","v":{"v":520302.005,"d":"520,302"}},{"$f":"I28+I28*Annahmen!$D10+'Daten Umschichtung'!J7","v":{"v":525505.02505,"d":"525,505"}}]
[null,5,"Bankguthaben B-Bank","Kontoguthaben",{"v":1000000,"d":"1,000,000"},{"$f":"E29+E29*Annahmen!$D11+'Daten Umschichtung'!F8","v":{"v":500000,"d":"500,000"}},{"$f":"F29+F29*Annahmen!$D11+'Daten Umschichtung'!G8","v":0},{"$f":"G29+G29*Annahmen!$D11+'Daten Umschichtung'!H8","v":0},{"$f":"H29+H29*Annahmen!$D11+'Daten Umschichtung'!I8","v":0},{"$f":"I29+I29*Annahmen!$D11+'Daten Umschichtung'!J8","v":0}]
[null,6,0,"Bitte auswählen",0,{"$f":"E30+E30*Annahmen!$D12+'Daten Umschichtung'!F9","v":0},{"$f":"F30+F30*Annahmen!$D12+'Daten Umschichtung'!G9","v":0},{"$f":"G30+G30*Annahmen!$D12+'Daten Umschichtung'!H9","v":0},{"$f":"H30+H30*Annahmen!$D12+'Daten Umschichtung'!I9","v":0},{"$f":"I30+I30*Annahmen!$D12+'Daten Umschichtung'!J9","v":0}]
[null,7,0,"Bitte auswählen",0,{"$f":"E31+E31*Annahmen!$D13+'Daten Umschichtung'!F10","v":0},{"$f":"F31+F31*Annahmen!$D13+'Daten Umschichtung'!G10","v":0},{"$f":"G31+G31*Annahmen!$D13+'Daten Umschichtung'!H10","v":0},{"$f":"H31+H31*Annahmen!$D13+'Daten Umschichtung'!I10","v":0},{"$f":"I31+I31*Annahmen!$D13+'Daten Umschichtung'!J10","v":0}]
[null,8,0,"Bitte auswählen",0,{"$f":"E32+E32*Annahmen!$D14+'Daten Umschichtung'!F11","v":0},{"$f":"F32+F32*Annahmen!$D14+'Daten Umschichtung'!G11","v":0},{"$f":"G32+G32*Annahmen!$D14+'Daten Umschichtung'!H11","v":0},{"$f":"H32+H32*Annahmen!$D14+'Daten Umschichtung'!I11","v":0},{"$f":"I32+I32*Annahmen!$D14+'Daten Umschichtung'!J11","v":0}]
[null,9,0,"Bitte auswählen",0,{"$f":"E33+E33*Annahmen!$D15+'Daten Umschichtung'!F12","v":0},{"$f":"F33+F33*Annahmen!$D15+'Daten Umschichtung'!G12","v":0},{"$f":"G33+G33*Annahmen!$D15+'Daten Umschichtung'!H12","v":0},{"$f":"H33+H33*Annahmen!$D15+'Daten Umschichtung'!I12","v":0},{"$f":"I33+I33*Annahmen!$D15+'Daten Umschichtung'!J12","v":0}]
[null,10,0,"Bitte auswählen",0,{"$f":"E34+E34*Annahmen!$D16+'Daten Umschichtung'!F13","v":0},{"$f":"F34+F34*Annahmen!$D16+'Daten Umschichtung'!G13","v":0},{"$f":"G34+G34*Annahmen!$D16+'Daten Umschichtung'!H13","v":0},{"$f":"H34+H34*Annahmen!$D16+'Daten Umschichtung'!I13","v":0},{"$f":"I34+I34*Annahmen!$D16+'Daten Umschichtung'!J13","v":0}]
[null,11,0,"Bitte auswählen",0,{"$f":"E35+E35*Annahmen!$D17+'Daten Umschichtung'!F14","v":0},{"$f":"F35+F35*Annahmen!$D17+'Daten Umschichtung'!G14","v":0},{"$f":"G35+G35*Annahmen!$D17+'Daten Umschichtung'!H14","v":0},{"$f":"H35+H35*Annahmen!$D17+'Daten Umschichtung'!I14","v":0},{"$f":"I35+I35*Annahmen!$D17+'Daten Umschichtung'!J14","v":0}]
[null,{"$f":"B15","v":12},{"$f":"C15","v":0},"Bitte auswählen",0,{"$f":"E36+E36*Annahmen!$D18+'Daten Umschichtung'!F15","v":0},{"$f":"F36+F36*Annahmen!$D18+'Daten Umschichtung'!G15","v":0},{"$f":"G36+G36*Annahmen!$D18+'Daten Umschichtung'!H15","v":0},{"$f":"H36+H36*Annahmen!$D18+'Daten Umschichtung'!I15","v":0},{"$f":"I36+I36*Annahmen!$D18+'Daten Umschichtung'!J15","v":0}]
[null,{"$f":"B16","v":"U1"},{"$f":"C16","v":"Aufstockung VV Aktien"},{"$f":"Umschichtung!D6","v":"Aktien"},0,{"$f":"E37+E37*Umschichtung!$K6+F16","v":0},{"$f":"F37+F37*Umschichtung!$K6+G16","v":{"v":500000,"d":"500,000"}},{"$f":"G37+G37*Umschichtung!$K6+H16","v":{"v":515000,"d":"515,000"}},{"$f":"H37+H37*Umschichtung!$K6+I16","v":{"v":530450,"d":"530,450"}},{"$f":"I37+I37*Umschichtung!$K6+J16","v":{"v":546363.5,"d":"546,364"}}]
[null,{"$f":"B17","v":"U2"},"ABC Stiftungsfonds",{"$f":"Umschichtung!D7","v":"Aktien"},0,{"$f":"E38+E38*Umschichtung!$K7+F17","v":{"v":500000,"d":"500,000"}},{"$f":"F38+F38*Umschichtung!$K7+G17","v":{"v":507500,"d":"507,500"}},{"$f":"G38+G38*Umschichtung!$K7+H17","v":{"v":515112.5,"d":"515,113"}},{"$f":"H38+H38*Umschichtung!$K7+I17","v":{"v":522839.1875,"d":"522,839"}},{"$f":"I38+I38*Umschichtung!$K7+J17","v":{"v":530681.7753125,"d":"530,682"}}]
[null,"U3",0,{"$f":"Umschichtung!D8","v":0},0,{"$f":"E39+E39*Umschichtung!$K8+F18","v":0},{"$f":"F39+F39*Umschichtung!$K8+G18","v":0},{"$f":"G39+G39*Umschichtung!$K8+H18","v":0},{"$f":"H39+H39*Umschichtung!$K8+I18","v":0},{"$f":"I39+I39*Umschichtung!$K8+J18","v":0}]
[null,"U4",0,{"$f":"Umschichtung!D9","v":0},0,{"$f":"E40+E40*Umschichtung!$K9+F19","v":0},{"$f":"F40+F40*Umschichtung!$K9+G19","v":0},{"$f":"G40+G40*Umschichtung!$K9+H19","v":0},{"$f":"H40+H40*Umschichtung!$K9+I19","v":0},{"$f":"I40+I40*Umschichtung!$K9+J19","v":0}]
[null,"U5",0,{"$f":"Umschichtung!D10","v":0},0,{"$f":"E41+E41*Umschichtung!$K10+F20","v":0},{"$f":"F41+F41*Umschichtung!$K10+G20","v":0},{"$f":"G41+G41*Umschichtung!$K10+H20","v":0},{"$f":"H41+H41*Umschichtung!$K10+I20","v":0},{"$f":"I41+I41*Umschichtung!$K10+J20","v":0}]
[null,"U6",0,{"$f":"Umschichtung!D11","v":0},0,{"$f":"E42+E42*Umschichtung!$K11+F21","v":0},{"$f":"F42+F42*Umschichtung!$K11+G21","v":0},{"$f":"G42+G42*Umschichtung!$K11+H21","v":0},{"$f":"H42+H42*Umschichtung!$K11+I21","v":0},{"$f":"I42+I42*Umschichtung!$K11+J21","v":0}]
[null,null,"Summe",null,{"$f":"SUM(E25:E42)","v":{"v":7600000,"d":"7,600,000"}},{"$f":"SUM(F25:F42)","v":{"v":7651750,"d":"7,651,750"}},{"$f":"SUM(G25:G42)","v":{"v":7711771.25,"d":"7,711,771"}},{"v":7787694.98125,"d":"7,787,695"},{"v":7864992.14740625,"d":"7,864,992"},{"$f":"SUM(J25:J42)","v":{"v":7943697.778205783,"d":"7,943,698"}}]
[]
[]
[null,null,"Vermögen Umschichtung nach AK","Immobilien",{"$f":"SUMIF($D$25:$D$36,$D46,E$25:E$42)","v":{"v":500000,"d":"500,000"}},{"$f":"SUMIF($D$25:$D$42,$D46,F$25:F$42)","v":{"v":505000,"d":"505,000"}},{"$f":"SUMIF($D$25:$D$42,$D46,G$25:G$42)","v":{"v":510050,"d":"510,050"}},{"v":515150.5,"d":"515,151"},{"v":520302.005,"d":"520,302"},{"$f":"SUMIF($D$25:$D$42,$D46,J$25:J$42)","v":{"v":525505.02505,"d":"525,505"}}]
[{"$nulls":3},"Beteiligungen",{"$f":"SUMIF($D$25:$D$36,$D47,E$25:E$42)","v":0},{"$f":"SUMIF($D$25:$D$42,$D47,F$25:F$42)","v":0},0,0,0,0]
[{"$nulls":3},"Wertpapiere",{"$f":"SUM(E49:E52)","v":{"v":6100000,"d":"6,100,000"}},{"$f":"SUM(F49:F52)","v":{"v":6646750,"d":"6,646,750"}},{"v":7201721.25,"d":"7,201,721"},{"v":7272544.48125,"d":"7,272,544"},{"v":7344690.14240625,"d":"7,344,690"},{"v":7418192.753155783,"d":"7,418,193"}]
[{"$nulls":3}," davon Aktien",{"$f":"SUMIF($D$25:$D$42,\"Aktien\",E$25:E$42)","v":{"v":650000,"d":"650,000"}},{"$f":"SUMIF($D$25:$D$42,\"Aktien\",F$25:F$42)","v":{"v":1169500,"d":"1,169,500"}},{"$f":"SUMIF($D$25:$D$42,\"Aktien\",G$25:G$42)","v":{"v":1697085,"d":"1,697,085"}},{"v":1740385.05,"d":"1,740,385"},{"v":1784869.914,"d":"1,784,870"},{"v":1830573.4236075003,"d":"1,830,573"}]
[{"$nulls":3}," davon Renten",{"$f":"SUMIF($D$25:$D$42,\"Renten\",E$25:E$42)","v":{"v":5450000,"d":"5,450,000"}},{"$f":"SUMIF($D$25:$D$42,\"Renten\",F$25:F$42)","v":{"v":5477250,"d":"5,477,250"}},{"v":5504636.25,"d":"5,504,636"},{"$f":"SUMIF($D$25:$D$42,\"Renten\",H$25:H$42)","v":{"v":5532159.43125,"d":"5,532,159"}},{"v":5559820.2284062505,"d":"5,559,820"},{"v":5587619.329548283,"d":"5,587,619"}]
[{"$nulls":3}," davon Liquidität",{"$f":"SUMIF($D$25:$D$42,\"Liquidität\",E$25:E$42)","v":0},{"$f":"SUMIF($D$25:$D$42,\"Liquidität\",F$25:F$42)","v":0},0,{"$f":"SUMIF($D$25:$D$42,\"Liquidität\",H$25:H$42)","v":0},0,0]
[{"$nulls":3}," davon Alternative Investments",{"$f":"SUMIF($D$25:$D$42,\"Alternative Investments\",E$25:E$42)","v":0},{"$f":"SUMIF($D$25:$D$42,\"Alternative Investments\",F$25:F$42)","v":0},{"$f":"SUMIF($D$25:$D$42,\"Alternative Investments\",G$25:G$42)","v":0},0,0,{"$f":"SUMIF($D$25:$D$42,\"Alternative Investments\",J$25:J$42)","v":0}]
[{"$nulls":3},"Spar- und Termineinlagen",{"$f":"SUMIF($D$25:$D$42,\"Spar- u. Termineinlagen\",E$25:E$42)","v":0},{"$f":"SUMIF($D$25:$D$42,\"Spar- u. Termineinlagen\",F$25:F$42)","v":0},0,0,0,0]
[{"$nulls":3},"Kontoguthaben Investitionsvermögen",{"$f":"SUMIF($D$25:$D$42,\"Kontoguthaben\",E$25:E$42)","v":{"v":1000000,"d":"1,000,000"}},{"$f":"SUMIF($D$25:$D$42,\"Kontoguthaben\",F$25:F$42)","v":{"v":500000,"d":"500,000"}},0,0,0,0]
[{"$nulls":3},"Sonstiges Vermögen",{"$f":"SUMIF($D$25:$D$42,\"Sonstiges Vermögen\",E$25:E$42)","v":0},{"$f":"SUMIF($D$25:$D$42,\"Sonstiges Vermögen\",F$25:F$42)","v":0},0,0,0,{"$f":"SUMIF($D$25:$D$42,\"Sonstiges Vermögen\",J$25:J$42)","v":0}]
[{"$nulls":3},"Verbindlichkeiten",{"$f":"SUMIF($D$25:$D$42,\"Verbindlichkeiten\",E$25:E$42)","v":0},{"$f":"SUMIF($D$25:$D$42,\"Verbindlichkeiten\",F$25:F$42)","v":0},0,0,0,{"$f":"SUMIF($D$25:$D$42,\"Verbindlichkeiten\",J$25:J$42)","v":0}]
[{"$nulls":3},"Summe",{"$f":"SUM(E46:E48)+SUM(E53:E56)","v":{"v":7600000,"d":"7,600,000"}},{"v":7651750,"d":"7,651,750"},{"v":7711771.25,"d":"7,711,771"},{"v":7787694.98125,"d":"7,787,695"},{"v":7864992.14740625,"d":"7,864,992"},{"v":7943697.778205783,"d":"7,943,698"}]
[]
[null,null,"Zielerreichung Vermögen",null,null,{"$f":"F24","v":2019},{"$f":"G24","v":2020},{"$f":"H24","v":2021},{"$f":"I24","v":2022},{"$f":"J24","v":2023}]
[{"$nulls":3},"Vermögenserhaltungsziel",{"$f":"'Daten VE'!H45","v":{"v":7575928.4191278955,"d":"7,575,928"}},{"$f":"'Daten VE'!I45","v":{"v":7727446.987510453,"d":"7,727,447"}},{"$f":"'Daten VE'!J45","v":{"v":7881995.927260662,"d":"7,881,996"}},{"$f":"'Daten VE'!K45","v":{"v":8039635.845805876,"d":"8,039,636"}},{"$f":"'Daten VE'!L45","v":{"v":8200428.562721994,"d":"8,200,429"}},{"$f":"'Daten VE'!M45","v":{"v":8364437.133976433,"d":"8,364,437"}}]
[{"$nulls":3},"Vermögen Basisszenario",{"$f":"'Daten Projektion'!H31","v":{"v":7600000,"d":"7,600,000"}},{"$f":"'Daten Projektion'!I31","v":{"v":7651750,"d":"7,651,750"}},{"$f":"'Daten Projektion'!J31","v":{"v":7704271.25,"d":"7,704,271"}},{"$f":"'Daten Projektion'!K31","v":{"v":7757582.48125,"d":"7,757,582"}},{"$f":"'Daten Projektion'!L31","v":{"v":7811702.95990625,"d":"7,811,703"}},{"$f":"'Daten Projektion'!M31","v":{"v":7866652.502893283,"d":"7,866,653"}}]
[{"$nulls":3},"Vermögen Umschichtung",{"$f":"E57","v":{"v":7600000,"d":"7,600,000"}},{"v":7651750,"d":"7,651,750"},{"v":7711771.25,"d":"7,711,771"},{"v":7787694.98125,"d":"7,787,695"},{"v":7864992.14740625,"d":"7,864,992"},{"v":7943697.778205783,"d":"7,943,698"}]
[{"$nulls":3},"Zielabweichung Vermögen Basisszenario",null,{"$f":"(F61-F60)/F60","v":{"v":-0.009795859827029397,"d":"-1.0%"}},{"$f":"(G61-G60)/G60","v":{"v":-0.022548181818514274,"d":"-2.3%"}},{"v":-0.03508285324925726,"d":"-3.5%"},{"v":-0.047403083856231126,"d":"-4.7%"},{"v":-0.05951202969308525,"d":"-6.0%"}]
[{"$nulls":3},"Zielabweichung Vermögen Umschichtung",null,{"$f":"(F62-F60)/F60","v":{"v":-0.009795859827029397,"d":"-1.0%"}},{"$f":"(G62-G60)/G60","v":{"v":-0.02159664618347791,"d":"-2.2%"}},{"v":-0.031337347783893535,"d":"-3.1%"},{"v":-0.04090474208147984,"d":"-4.1%"},{"v":-0.0503009765070267,"d":"-5.0%"}]
[]
[null,null,"Erträge Umschichtung"]
[]
[null,{"$f":"B24","v":"Nr."},"Vermögensgegenstand","Anlageklasse",null,{"$f":"F59","v":2019},{"$f":"G59","v":2020},{"$f":"H59","v":2021},{"$f":"I59","v":2022},{"$f":"J59","v":2023}]
[null,1,"Vermögensverwaltung A-Bank Aktien","Aktien",{"$f":"IF(D69=\"Verbindlichkeiten\",-1,1)","v":1},{"$f":"E25*$E69*Annahmen!$E7","v":{"v":16250,"d":"16,250"}},{"$f":"F25*$E69*Annahmen!$E$7","v":{"v":16737.5,"d":"16,738"}},{"$f":"G25*$E69*Annahmen!$E$7","v":{"v":17239.625,"d":"17,240"}},{"$f":"H25*$E69*Annahmen!$E$7","v":{"v":17756.81375,"d":"17,757"}},{"$f":"I25*$E69*Annahmen!$E$7","v":{"v":18289.518162500004,"d":"18,290"}}]
[null,2,"Vermögensverwaltung A-Bank Renten","Renten",{"$f":"IF(D70=\"Verbindlichkeiten\",-1,1)","v":1},{"$f":"E26*$E70*Annahmen!$E8","v":{"v":26000,"d":"26,000"}},{"$f":"F26*$E70*Annahmen!$E8","v":{"v":26130,"d":"26,130"}},{"$f":"G26*$E70*Annahmen!$E8","v":{"v":26260.65,"d":"26,261"}},{"$f":"H26*$E70*Annahmen!$E8","v":{"v":26391.953250000002,"d":"26,392"}},{"$f":"I26*$E70*Annahmen!$E8","v":{"v":26523.913016250004,"d":"26,524"}}]
[null,3,"Stiftungsfonds Xy","Renten",1,{"$f":"E27*$E71*Annahmen!$E9","v":{"v":6250,"d":"6,250"}},{"$f":"F27*$E71*Annahmen!$E9","v":{"v":6281.25,"d":"6,281"}},{"$f":"G27*$E71*Annahmen!$E9","v":{"v":6312.65625,"d":"6,313"}},{"$f":"H27*$E71*Annahmen!$E9","v":{"v":6344.219531250001,"d":"6,344"}},{"$f":"I27*$E71*Annahmen!$E9","v":{"v":6375.94062890625,"d":"6,376"}}]
[null,4,"Immobilie","Immobilien",1,{"$f":"E28*$E72*Annahmen!$E10","v":{"v":10000,"d":"10,000"}},{"$f":"F28*$E72*Annahmen!$E10","v":{"v":10100,"d":"10,100"}},{"$f":"G28*$E72*Annahmen!$E10","v":{"v":10201,"d":"10,201"}},{"$f":"H28*$E72*Annahmen!$E10","v":{"v":10303.01,"d":"10,303"}},{"$f":"I28*$E72*Annahmen!$E10","v":{"v":10406.0401,"d":"10,406"}}]
[null,5,"Bankguthaben B-Bank","Kontoguthaben",1,{"$f":"E29*$E73*Annahmen!$E11","v":0},{"$f":"F29*$E73*Annahmen!$E11","v":0},{"$f":"G29*$E73*Annahmen!$E11","v":0},{"$f":"H29*$E73*Annahmen!$E11","v":0},{"$f":"I29*$E73*Annahmen!$E11","v":0}]
[null,6,0,"Bitte auswählen",1,{"$f":"E30*$E74*Annahmen!$E12","v":0},{"$f":"F30*$E74*Annahmen!$E12","v":0},{"$f":"G30*$E74*Annahmen!$E12","v":0},{"$f":"H30*$E74*Annahmen!$E12","v":0},{"$f":"I30*$E74*Annahmen!$E12","v":0}]
[null,7,0,"Bitte auswählen",1,{"$f":"E31*$E75*Annahmen!$E13","v":0},{"$f":"F31*$E75*Annahmen!$E13","v":0},{"$f":"G31*$E75*Annahmen!$E13","v":0},{"$f":"H31*$E75*Annahmen!$E13","v":0},{"$f":"I31*$E75*Annahmen!$E13","v":0}]
[null,8,0,"Bitte auswählen",1,{"$f":"E32*$E76*Annahmen!$E14","v":0},{"$f":"F32*$E76*Annahmen!$E14","v":0},{"$f":"G32*$E76*Annahmen!$E14","v":0},{"$f":"H32*$E76*Annahmen!$E14","v":0},{"$f":"I32*$E76*Annahmen!$E14","v":0}]
[null,9,0,"Bitte auswählen",1,{"$f":"E33*$E77*Annahmen!$E15","v":0},{"$f":"F33*$E77*Annahmen!$E15","v":0},{"$f":"G33*$E77*Annahmen!$E15","v":0},{"$f":"H33*$E77*Annahmen!$E15","v":0},{"$f":"I33*$E77*Annahmen!$E15","v":0}]
[null,10,0,"Bitte auswählen",1,{"$f":"E34*$E78*Annahmen!$E16","v":0},{"$f":"F34*$E78*Annahmen!$E16","v":0},{"$f":"G34*$E78*Annahmen!$E16","v":0},{"$f":"H34*$E78*Annahmen!$E16","v":0},{"$f":"I34*$E78*Annahmen!$E16","v":0}]
[null,11,0,"Bitte auswählen",1,{"$f":"E35*$E79*Annahmen!$E17","v":0},{"$f":"F35*$E79*Annahmen!$E17","v":0},{"$f":"G35*$E79*Annahmen!$E17","v":0},{"$f":"H35*$E79*Annahmen!$E17","v":0},{"$f":"I35*$E79*Annahmen!$E17","v":0}]
[null,12,0,"Bitte auswählen",1,{"$f":"E36*$E80*Annahmen!$E18","v":0},{"$f":"F36*$E80*Annahmen!$E18","v":0},{"$f":"G36*$E80*Annahmen!$E18","v":0},{"$f":"H36*$E80*Annahmen!$E18","v":0},{"$f":"I36*$E80*Annahmen!$E18","v":0}]
[null,"U1","Aufstockung VV Aktien","Aktien",1,{"$f":"E37*$E81*Umschichtung!$L6","v":0},{"$f":"F37*$E81*Umschichtung!$L6","v":0},{"$f":"G37*$E81*Umschichtung!$L6","v":{"v":10000,"d":"10,000"}},{"$f":"H37*$E81*Umschichtung!$L6","v":{"v":10300,"d":"10,300"}},{"$f":"I37*$E81*Umschichtung!$L6","v":{"v":10609,"d":"10,609"}}]
[null,"U2","ABC Stiftungsfonds","Aktien",1,{"$f":"E38*$E82*Umschichtung!$L7","v":0},{"$f":"F38*$E82*Umschichtung!$L7","v":{"v":7500,"d":"7,500"}},{"$f":"G38*$E82*Umschichtung!$L7","v":{"v":7612.5,"d":"7,613"}},{"$f":"H38*$E82*Umschichtung!$L7","v":{"v":7726.6875,"d":"7,727"}},{"$f":"I38*$E82*Umschichtung!$L7","v":{"v":7842.5878125,"d":"7,843"}}]
[null,"U3",0,0,1,{"$f":"E39*$E83*Umschichtung!$L8","v":0},{"$f":"F39*$E83*Umschichtung!$L8","v":0},{"$f":"G39*$E83*Umschichtung!$L8","v":0},{"$f":"H39*$E83*Umschichtung!$L8","v":0},{"$f":"I39*$E83*Umschichtung!$L8","v":0}]
[null,"U4",0,0,1,{"$f":"E40*$E84*Umschichtung!$L9","v":0},{"$f":"F40*$E84*Umschichtung!$L9","v":0},{"$f":"G40*$E84*Umschichtung!$L9","v":0},{"$f":"H40*$E84*Umschichtung!$L9","v":0},{"$f":"I40*$E84*Umschichtung!$L9","v":0}]
[null,"U5",0,0,1,{"$f":"E41*$E85*Umschichtung!$L10","v":0},{"$f":"F41*$E85*Umschichtung!$L10","v":0},{"$f":"G41*$E85*Umschichtung!$L10","v":0},{"$f":"H41*$E85*Umschichtung!$L10","v":0},{"$f":"I41*$E85*Umschichtung!$L10","v":0}]
[null,"U6",0,0,1,{"$f":"E42*$E86*Umschichtung!$L11","v":0},{"$f":"F42*$E86*Umschichtung!$L11","v":0},{"$f":"G42*$E86*Umschichtung!$L11","v":0},{"$f":"H42*$E86*Umschichtung!$L11","v":0},{"$f":"I42*$E86*Umschichtung!$L11","v":0}]
[null,null,"Summe",null,null,{"$f":"SUM(F69:F86)","v":{"v":58500,"d":"58,500"}},{"$f":"SUM(G69:G86)","v":{"v":66748.75,"d":"66,749"}},{"v":77626.43125,"d":"77,626"},{"v":78822.68403125001,"d":"78,823"},{"v":80046.99972015625,"d":"80,047"}]
[]
[null,null,"Erträge Umschichtung nach AK",{"$f":"'Daten Projektion'!G20","v":"Immobilien"},null,{"$f":"SUMIF($D$69:$D$86,\"Immobilien\",F$69:F$86)","v":{"v":10000,"d":"10,000"}},{"$f":"SUMIF($D$69:$D$86,\"Immobilien\",G69:G86)","v":{"v":10100,"d":"10,100"}},{"$f":"SUMIF($D$69:$D$86,\"Immobilien\",H69:H86)","v":{"v":10201,"d":"10,201"}},{"v":10303.01,"d":"10,303"},{"v":10406.0401,"d":"10,406"}]
[{"$nulls":3},{"$f":"'Daten Projektion'!G21","v":"Beteiligungen"},null,{"$f":"SUMIF($D$69:$D$86,\"Beteiligungen\",F$69:F$86)","v":0},{"$f":"SUMIF($D$69:$D$86,\"Beteiligungen\",G$69:G$86)","v":0},0,0,0]
[{"$nulls":3},{"$f":"'Daten Projektion'!G22","v":"Wertpapiere"},null,{"$f":"SUM(F92:F95)","v":{"v":48500,"d":"48,500"}},{"$f":"SUM(G92:G95)","v":{"v":56648.75,"d":"56,649"}},{"v":67425.43125,"d":"67,425"},{"v":68519.67403125,"d":"68,520"},{"v":69640.95962015627,"d":"69,641"}]
[{"$nulls":3},{"$f":"'Daten Projektion'!G23","v":" davon Aktien"},null,{"$f":"SUMIF($D$69:$D$86,\"Aktien\",F$69:F$86)","v":{"v":16250,"d":"16,250"}},{"$f":"SUMIF($D$69:$D$86,\"Aktien\",G$69:G$86)","v":{"v":24237.5,"d":"24,238"}},{"v":34852.125,"d":"34,852"},{"v":35783.50125,"d":"35,784"},{"v":36741.105975000006,"d":"36,741"}]
[{"$nulls":3},{"$f":"'Daten Projektion'!G24","v":" davon Renten"},null,{"$f":"SUMIF($D$69:$D$86,\"Renten\",F$69:F$86)","v":{"v":32250,"d":"32,250"}},{"$f":"SUMIF($D$69:$D$86,\"Renten\",G$69:G$86)","v":{"v":32411.25,"d":"32,411"}},{"v":32573.30625,"d":"32,573"},{"v":32736.172781250003,"d":"32,736"},{"v":32899.853645156254,"d":"32,900"}]
[{"$nulls":3},{"$f":"'Daten Projektion'!G25","v":" davon Liquidität"},null,{"$f":"SUMIF($D$69:$D$86,\"LIquidität\",F$69:F$86)","v":0},{"$f":"SUMIF($D$69:$D$86,\"LIquidität\",G$69:G$86)","v":0},0,0,0]
[{"$nulls":3},{"$f":"'Daten Projektion'!G26","v":" davon Alternative Investments"},null,{"$f":"SUMIF($D$69:$D$86,\"Alternative Investments\",F$69:F$86)","v":0},{"$f":"SUMIF($D$69:$D$86,\"Alternative Investments\",G$69:G$86)","v":0},0,0,0]
[{"$nulls":3},{"$f":"'Daten Projektion'!G27","v":"Spar- und Termineinlagen"},null,{"$f":"SUMIF($D$69:$D$86,\"Spar- u. Termineinlagen\",F$69:F$86)","v":0},{"$f":"SUMIF($D$69:$D$86,\"Spar- u. Termineinlagen\",G$69:G$86)","v":0},0,0,0]
[{"$nulls":3},{"$f":"'Daten Projektion'!G28","v":"Kontoguthaben Investitionsvermögen"},null,{"$f":"SUMIF($D$69:$D$86,\"Kontoguthaben\",F$69:F$86)","v":0},{"$f":"SUMIF($D$69:$D$86,\"Kontoguthaben\",G$69:G$86)","v":0},0,0,0]
[{"$nulls":3},{"$f":"'Daten Projektion'!G29","v":"Sonstiges Vermögen"},null,{"$f":"SUMIF($D$69:$D$86,\"Sonstiges Vermögen\",F$69:F$86)","v":0},{"$f":"SUMIF($D$69:$D$86,\"Sonstiges Vermögen\",G$69:G$86)","v":0},0,0,0]
[{"$nulls":3},{"$f":"'Daten Projektion'!G30","v":"Verbindlichkeiten"},null,{"$f":"SUMIF($D$69:$D$86,\"Verbindlichkeiten\",F$69:F$86)","v":0},{"$f":"SUMIF($D$69:$D$86,\"Verbindlichkeiten\",G$69:G$86)","v":0},0,0,0]
[{"$nulls":3},{"$f":"'Daten Projektion'!G31","v":"Summe"},null,{"$f":"SUM(F89:F91)+SUM(F96:F99)","v":{"v":58500,"d":"58,500"}},{"$f":"SUM(G89:G91)+SUM(G96:G99)","v":{"v":66748.75,"d":"66,749"}},{"v":77626.43125,"d":"77,626"},{"v":78822.68403125,"d":"78,823"},{"v":80046.99972015627,"d":"80,047"}]
[]
[null,null,"Zielerreichung Erträge",null,null,{"$f":"F3","v":2019},{"$f":"G3","v":2020},2021,2022,2023]
[{"$nulls":3},"Ertragsziel",null,{"$f":"'Daten Projektion'!I103","v":{"v":64822.4,"d":"64,822"}},{"$f":"'Daten Projektion'!J103","v":{"v":64249.8355,"d":"64,250"}},{"$f":"'Daten Projektion'!K103","v":{"v":65196.30027250001,"d":"65,196"}},{"$f":"'Daten Projektion'!L103","v":{"v":66162.2158745125,"d":"66,162"}},{"$f":"'Daten Projektion'!M103","v":{"v":67148.01368911056,"d":"67,148"}}]
[{"$nulls":3},"Erträge Basiszenario",null,{"$f":"'Daten Projektion'!I104","v":{"v":58500,"d":"58,500"}},{"$f":"'Daten Projektion'!J104","v":{"v":59248.75,"d":"59,249"}},{"$f":"'Daten Projektion'!K104","v":{"v":60013.93125,"d":"60,014"}},{"$f":"'Daten Projektion'!L104","v":{"v":60795.996531250006,"d":"60,796"}},{"$f":"'Daten Projektion'!M104","v":{"v":61595.41190765626,"d":"61,595"}}]
[{"$nulls":3},"Erträge Umschichtung",null,{"$f":"F100","v":{"v":58500,"d":"58,500"}},{"$f":"G100","v":{"v":66748.75,"d":"66,749"}},{"v":77626.43125,"d":"77,626"},{"v":78822.68403125,"d":"78,823"},{"v":80046.99972015627,"d":"80,047"}]
[{"$nulls":3},"Zielabweichung Erträge Basisszenario",null,{"$f":"(F104-F103)/F103","v":{"v":-0.09753418571358051,"d":"-9.8%"}},{"$f":"(G104-G103)/G103","v":{"v":-0.07783810590456688,"d":"-7.8%"}},{"v":-0.07948869799113353,"d":"-7.9%"},{"v":-0.08110700756214717,"d":"-8.1%"},{"v":-0.08269197369206437,"d":"-8.3%"}]
[{"$nulls":3},"Zielabweichung Erträge Umschichtung",null,{"$f":"(F105-F103)/F103","v":{"v":-0.09753418571358051,"d":"-9.8%"}},{"$f":"(G105-G103)/G103","v":{"v":0.03889371047494743,"d":"3.9%"}},{"v":0.19065699933195515,"d":"19.1%"},{"v":0.19135495976661587,"d":"19.1%"},{"v":0.19209780486980418,"d":"19.2%"}]
[]
[null,null,"Risiko Umschichtung"]
[]
[null,{"$f":"B68","v":"Nr."},{"$f":"C68","v":"Vermögensgegenstand"},"Anlageklasse",null,{"$f":"F68","v":2019},{"$f":"G68","v":2020},2021,2022,2023]
[null,1,{"$f":"C69","v":"Vermögensverwaltung A-Bank Aktien"},"Aktien",{"$f":"'Daten Projektion'!H6","v":{"v":650000,"d":"650,000"}},{"$f":"E112+IF(F$111>=Annahmen!$L7,0,IF(F$111=Annahmen!$K7,'Daten Umschichtung'!E112*Annahmen!$I7,E112*Annahmen!$D7))+F4","v":{"v":669500,"d":"669,500"}},{"$f":"F112+IF(G$111>=Annahmen!$L7,0,IF(G$111=Annahmen!$K7,'Daten Umschichtung'!F112*Annahmen!$I7,F112*Annahmen!$D7))+G4","v":{"v":468650,"d":"468,650"}},{"$f":"G112+IF(H$111>=Annahmen!$L7,0,IF(H$111=Annahmen!$K7,'Daten Umschichtung'!G112*Annahmen!$I7,G112*Annahmen!$D7))+H4","v":{"v":482709.5,"d":"482,710"}},{"$f":"H112+IF(I$111>=Annahmen!$L7,0,IF(I$111=Annahmen!$K7,'Daten Umschichtung'!H112*Annahmen!$I7,H112*Annahmen!$D7))+I4","v":{"v":497190.785,"d":"497,191"}},{"$f":"I112+IF(J$111>=Annahmen!$L7,0,IF(J$111=Annahmen!$K7,'Daten Umschichtung'!I112*Annahmen!$I7,I112*Annahmen!$D7))+J4","v":{"v":512106.50854999997,"d":"512,107"}}]
[null,2,"Vermögensverwaltung A-Bank Renten","Renten",{"$f":"'Daten Projektion'!H7","v":{"v":5200000,"d":"5,200,000"}},{"$f":"E113+IF(F$111>=Annahmen!$L8,0,IF(F$111=Annahmen!$K8,'Daten Umschichtung'!E113*Annahmen!$I8,E113*Annahmen!$D8))+F5","v":{"v":5226000,"d":"5,226,000"}},{"$f":"F113+IF(G$111>=Annahmen!$L8,0,IF(G$111=Annahmen!$K8,'Daten Umschichtung'!F113*Annahmen!$I8,F113*Annahmen!$D8))+G5","v":{"v":4703400,"d":"4,703,400"}},{"$f":"G113+IF(H$111>=Annahmen!$L8,0,IF(H$111=Annahmen!$K8,'Daten Umschichtung'!G113*Annahmen!$I8,G113*Annahmen!$D8))+H5","v":{"v":4726917,"d":"4,726,917"}},{"$f":"H113+IF(I$111>=Annahmen!$L8,0,IF(I$111=Annahmen!$K8,'Daten Umschichtung'!H113*Annahmen!$I8,H113*Annahmen!$D8))+I5","v":{"v":4750551.585,"d":"4,750,552"}},{"$f":"I113+IF(J$111>=Annahmen!$L8,0,IF(J$111=Annahmen!$K8,'Daten Umschichtung'!I113*Annahmen!$I8,I113*Annahmen!$D8))+J5","v":{"v":4774304.342925,"d":"4,774,304"}}]
[null,3,"Stiftungsfonds Xy","Renten",{"$f":"'Daten Projektion'!H8","v":{"v":250000,"d":"250,000"}},{"$f":"E114+IF(F$111>=Annahmen!$L9,0,IF(F$111=Annahmen!$K9,'Daten Umschichtung'!E114*Annahmen!$I9,E114*Annahmen!$D9))+F6","v":{"v":251250,"d":"251,250"}},{"$f":"F114+IF(G$111>=Annahmen!$L9,0,IF(G$111=Annahmen!$K9,'Daten Umschichtung'!F114*Annahmen!$I9,F114*Annahmen!$D9))+G6","v":{"v":251250,"d":"251,250"}},{"$f":"G114+IF(H$111>=Annahmen!$L9,0,IF(H$111=Annahmen!$K9,'Daten Umschichtung'!G114*Annahmen!$I9,G114*Annahmen!$D9))+H6","v":{"v":252506.25,"d":"252,506"}},{"$f":"H114+IF(I$111>=Annahmen!$L9,0,IF(I$111=Annahmen!$K9,'Daten Umschichtung'!H114*Annahmen!$I9,H114*Annahmen!$D9))+I6","v":{"v":253768.78125,"d":"253,769"}},{"$f":"I114+IF(J$111>=Annahmen!$L9,0,IF(J$111=Annahmen!$K9,'Daten Umschichtung'!I114*Annahmen!$I9,I114*Annahmen!$D9))+J6","v":{"v":255037.62515625,"d":"255,038"}}]
[null,4,"Immobilie","Immobilien",{"$f":"'Daten Projektion'!H9","v":{"v":500000,"d":"500,000"}},{"$f":"E115+IF(F$111>=Annahmen!$L10,0,IF(F$111=Annahmen!$K10,'Daten Umschichtung'!E115*Annahmen!$I10,E115*Annahmen!$D10))+F7","v":{"v":505000,"d":"505,000"}},{"$f":"F115+IF(G$111>=Annahmen!$L10,0,IF(G$111=Annahmen!$K10,'Daten Umschichtung'!F115*Annahmen!$I10,F115*Annahmen!$D10))+G7","v":{"v":505000,"d":"505,000"}},{"$f":"G115+IF(H$111>=Annahmen!$L10,0,IF(H$111=Annahmen!$K10,'Daten Umschichtung'!G115*Annahmen!$I10,G115*Annahmen!$D10))+H7","v":{"v":510050,"d":"510,050"}},{"$f":"H115+IF(I$111>=Annahmen!$L10,0,IF(I$111=Annahmen!$K10,'Daten Umschichtung'!H115*Annahmen!$I10,H115*Annahmen!$D10))+I7","v":{"v":515150.5,"d":"515,151"}},{"$f":"I115+IF(J$111>=Annahmen!$L10,0,IF(J$111=Annahmen!$K10,'Daten Umschichtung'!I115*Annahmen!$I10,I115*Annahmen!$D10))+J7","v":{"v":520302.005,"d":"520,302"}}]
[null,5,"Bankguthaben B-Bank","Kontoguthaben",{"$f":"'Daten Projektion'!H10","v":{"v":1000000,"d":"1,000,000"}},{"$f":"E116+IF(F$111>=Annahmen!$L11,0,IF(F$111=Annahmen!$K11,'Daten Umschichtung'!E116*Annahmen!$I11,E116*Annahmen!$D11))+F8","v":{"v":500000,"d":"500,000"}},{"$f":"F116+IF(G$111>=Annahmen!$L11,0,IF(G$111=Annahmen!$K11,'Daten Umschichtung'!F116*Annahmen!$I11,F116*Annahmen!$D11))+G8","v":0},{"$f":"G116+IF(H$111>=Annahmen!$L11,0,IF(H$111=Annahmen!$K11,'Daten Umschichtung'!G116*Annahmen!$I11,G116*Annahmen!$D11))+H8","v":0},{"$f":"H116+IF(I$111>=Annahmen!$L11,0,IF(I$111=Annahmen!$K11,'Daten Umschichtung'!H116*Annahmen!$I11,H116*Annahmen!$D11))+I8","v":0},{"$f":"I116+IF(J$111>=Annahmen!$L11,0,IF(J$111=Annahmen!$K11,'Daten Umschichtung'!I116*Annahmen!$I11,I116*Annahmen!$D11))+J8","v":0}]
[null,6,0,"Bitte auswählen",{"$f":"'Daten Projektion'!H11","v":0},{"$f":"E117+IF(F$111>=Annahmen!$L12,0,IF(F$111=Annahmen!$K12,'Daten Umschichtung'!E117*Annahmen!$I12,E117*Annahmen!$D12))+F9","v":0},{"$f":"F117+IF(G$111>=Annahmen!$L12,0,IF(G$111=Annahmen!$K12,'Daten Umschichtung'!F117*Annahmen!$I12,F117*Annahmen!$D12))+G9","v":0},{"$f":"G117+IF(H$111>=Annahmen!$L12,0,IF(H$111=Annahmen!$K12,'Daten Umschichtung'!G117*Annahmen!$I12,G117*Annahmen!$D12))+H9","v":0},{"$f":"H117+IF(I$111>=Annahmen!$L12,0,IF(I$111=Annahmen!$K12,'Daten Umschichtung'!H117*Annahmen!$I12,H117*Annahmen!$D12))+I9","v":0},{"$f":"I117+IF(J$111>=Annahmen!$L12,0,IF(J$111=Annahmen!$K12,'Daten Umschichtung'!I117*Annahmen!$I12,I117*Annahmen!$D12))+J9","v":0}]
[null,7,0,"Bitte auswählen",{"$f":"'Daten Projektion'!H12","v":0},{"$f":"E118+IF(F$111>=Annahmen!$L13,0,IF(F$111=Annahmen!$K13,'Daten Umschichtung'!E118*Annahmen!$I13,E118*Annahmen!$D13))+F10","v":0},{"$f":"F118+IF(G$111>=Annahmen!$L13,0,IF(G$111=Annahmen!$K13,'Daten Umschichtung'!F118*Annahmen!$I13,F118*Annahmen!$D13))+G10","v":0},{"$f":"G118+IF(H$111>=Annahmen!$L13,0,IF(H$111=Annahmen!$K13,'Daten Umschichtung'!G118*Annahmen!$I13,G118*Annahmen!$D13))+H10","v":0},{"$f":"H118+IF(I$111>=Annahmen!$L13,0,IF(I$111=Annahmen!$K13,'Daten Umschichtung'!H118*Annahmen!$I13,H118*Annahmen!$D13))+I10","v":0},{"$f":"I118+IF(J$111>=Annahmen!$L13,0,IF(J$111=Annahmen!$K13,'Daten Umschichtung'!I118*Annahmen!$I13,I118*Annahmen!$D13))+J10","v":0}]
[null,8,0,"Bitte auswählen",{"$f":"'Daten Projektion'!H13","v":0},{"$f":"E119+IF(F$111>=Annahmen!$L14,0,IF(F$111=Annahmen!$K14,'Daten Umschichtung'!E119*Annahmen!$I14,E119*Annahmen!$D14))+F11","v":0},{"$f":"F119+IF(G$111>=Annahmen!$L14,0,IF(G$111=Annahmen!$K14,'Daten Umschichtung'!F119*Annahmen!$I14,F119*Annahmen!$D14))+G11","v":0},{"$f":"G119+IF(H$111>=Annahmen!$L14,0,IF(H$111=Annahmen!$K14,'Daten Umschichtung'!G119*Annahmen!$I14,G119*Annahmen!$D14))+H11","v":0},{"$f":"H119+IF(I$111>=Annahmen!$L14,0,IF(I$111=Annahmen!$K14,'Daten Umschichtung'!H119*Annahmen!$I14,H119*Annahmen!$D14))+I11","v":0},{"$f":"I119+IF(J$111>=Annahmen!$L14,0,IF(J$111=Annahmen!$K14,'Daten Umschichtung'!I119*Annahmen!$I14,I119*Annahmen!$D14))+J11","v":0}]
[null,9,0,"Bitte auswählen",{"$f":"'Daten Projektion'!H14","v":0},{"$f":"E120+IF(F$111>=Annahmen!$L15,0,IF(F$111=Annahmen!$K15,'Daten Umschichtung'!E120*Annahmen!$I15,E120*Annahmen!$D15))+F12","v":0},{"$f":"F120+IF(G$111>=Annahmen!$L15,0,IF(G$111=Annahmen!$K15,'Daten Umschichtung'!F120*Annahmen!$I15,F120*Annahmen!$D15))+G12","v":0},{"$f":"G120+IF(H$111>=Annahmen!$L15,0,IF(H$111=Annahmen!$K15,'Daten Umschichtung'!G120*Annahmen!$I15,G120*Annahmen!$D15))+H12","v":0},{"$f":"H120+IF(I$111>=Annahmen!$L15,0,IF(I$111=Annahmen!$K15,'Daten Umschichtung'!H120*Annahmen!$I15,H120*Annahmen!$D15))+I12","v":0},{"$f":"I120+IF(J$111>=Annahmen!$L15,0,IF(J$111=Annahmen!$K15,'Daten Umschichtung'!I120*Annahmen!$I15,I120*Annahmen!$D15))+J12","v":0}]
[null,10,0,"Bitte auswählen",{"$f":"'Daten Projektion'!H15","v":0},{"$f":"E121+IF(F$111>=Annahmen!$L16,0,IF(F$111=Annahmen!$K16,'Daten Umschichtung'!E121*Annahmen!$I16,E121*Annahmen!$D16))+F13","v":0},{"$f":"F121+IF(G$111>=Annahmen!$L16,0,IF(G$111=Annahmen!$K16,'Daten Umschichtung'!F121*Annahmen!$I16,F121*Annahmen!$D16))+G13","v":0},{"$f":"G121+IF(H$111>=Annahmen!$L16,0,IF(H$111=Annahmen!$K16,'Daten Umschichtung'!G121*Annahmen!$I16,G121*Annahmen!$D16))+H13","v":0},{"$f":"H121+IF(I$111>=Annahmen!$L16,0,IF(I$111=Annahmen!$K16,'Daten Umschichtung'!H121*Annahmen!$I16,H121*Annahmen!$D16))+I13","v":0},{"$f":"I121+IF(J$111>=Annahmen!$L16,0,IF(J$111=Annahmen!$K16,'Daten Umschichtung'!I121*Annahmen!$I16,I121*Annahmen!$D16))+J13","v":0}]
[null,11,0,"Bitte auswählen",{"$f":"'Daten Projektion'!H16","v":0},{"$f":"E122+IF(F$111>=Annahmen!$L17,0,IF(F$111=Annahmen!$K17,'Daten Umschichtung'!E122*Annahmen!$I17,E122*Annahmen!$D17))+F14","v":0},{"$f":"F122+IF(G$111>=Annahmen!$L17,0,IF(G$111=Annahmen!$K17,'Daten Umschichtung'!F122*Annahmen!$I17,F122*Annahmen!$D17))+G14","v":0},{"$f":"G122+IF(H$111>=Annahmen!$L17,0,IF(H$111=Annahmen!$K17,'Daten Umschichtung'!G122*Annahmen!$I17,G122*Annahmen!$D17))+H14","v":0},{"$f":"H122+IF(I$111>=Annahmen!$L17,0,IF(I$111=Annahmen!$K17,'Daten Umschichtung'!H122*Annahmen!$I17,H122*Annahmen!$D17))+I14","v":0},{"$f":"I122+IF(J$111>=Annahmen!$L17,0,IF(J$111=Annahmen!$K17,'Daten Umschichtung'!I122*Annahmen!$I17,I122*Annahmen!$D17))+J14","v":0}]
[null,12,0,"Bitte auswählen",{"$f":"'Daten Projektion'!H17","v":0},{"$f":"E123+IF(F$111>=Annahmen!$L18,0,IF(F$111=Annahmen!$K18,'Daten Umschichtung'!E123*Annahmen!$I18,E123*Annahmen!$D18))+F15","v":0},{"$f":"F123+IF(G$111>=Annahmen!$L18,0,IF(G$111=Annahmen!$K18,'Daten Umschichtung'!F123*Annahmen!$I18,F123*Annahmen!$D18))+G15","v":0},{"$f":"G123+IF(H$111>=Annahmen!$L18,0,IF(H$111=Annahmen!$K18,'Daten Umschichtung'!G123*Annahmen!$I18,G123*Annahmen!$D18))+H15","v":0},{"$f":"H123+IF(I$111>=Annahmen!$L18,0,IF(I$111=Annahmen!$K18,'Daten Umschichtung'!H123*Annahmen!$I18,H123*Annahmen!$D18))+I15","v":0},{"$f":"I123+IF(J$111>=Annahmen!$L18,0,IF(J$111=Annahmen!$K18,'Daten Umschichtung'!I123*Annahmen!$I18,I123*Annahmen!$D18))+J15","v":0}]
[null,"U1","Aufstockung VV Aktien","Aktien",{"$f":"E16","v":0},{"$f":"'Daten Umschichtung'!E124+IF(F$111=Umschichtung!$O6,'Daten Umschichtung'!E124*Umschichtung!$N6,'Daten Umschichtung'!E124*Umschichtung!$K6)+F16","v":0},{"$f":"'Daten Umschichtung'!F124+IF(G$111=Umschichtung!$O6,'Daten Umschichtung'!F124*Umschichtung!$N6,'Daten Umschichtung'!F124*Umschichtung!$K6)+G16","v":{"v":500000,"d":"500,000"}},{"$f":"'Daten Umschichtung'!G124+IF(H$111=Umschichtung!$O6,'Daten Umschichtung'!G124*Umschichtung!$N6,'Daten Umschichtung'!G124*Umschichtung!$K6)+H16","v":{"v":515000,"d":"515,000"}},{"$f":"'Daten Umschichtung'!H124+IF(I$111=Umschichtung!$O6,'Daten Umschichtung'!H124*Umschichtung!$N6,'Daten Umschichtung'!H124*Umschichtung!$K6)+I16","v":{"v":530450,"d":"530,450"}},{"$f":"'Daten Umschichtung'!I124+IF(J$111=Umschichtung!$O6,'Daten Umschichtung'!I124*Umschichtung!$N6,'Daten Umschichtung'!I124*Umschichtung!$K6)+J16","v":{"v":546363.5,"d":"546,364"}}]
[null,"U2","ABC Stiftungsfonds","Aktien",0,{"$f":"'Daten Umschichtung'!E125+IF(F$111=Umschichtung!$O7,'Daten Umschichtung'!E125*Umschichtung!$N7,'Daten Umschichtung'!E125*Umschichtung!$K7)+F17","v":{"v":500000,"d":"500,000"}},{"$f":"'Daten Umschichtung'!F125+IF(G$111=Umschichtung!$O7,'Daten Umschichtung'!F125*Umschichtung!$N7,'Daten Umschichtung'!F125*Umschichtung!$K7)+G17","v":{"v":450000,"d":"450,000"}},{"$f":"'Daten Umschichtung'!G125+IF(H$111=Umschichtung!$O7,'Daten Umschichtung'!G125*Umschichtung!$N7,'Daten Umschichtung'!G125*Umschichtung!$K7)+H17","v":{"v":456750,"d":"456,750"}},{"$f":"'Daten Umschichtung'!H125+IF(I$111=Umschichtung!$O7,'Daten Umschichtung'!H125*Umschichtung!$N7,'Daten Umschichtung'!H125*Umschichtung!$K7)+I17","v":{"v":463601.25,"d":"463,601"}},{"$f":"'Daten Umschichtung'!I125+IF(J$111=Umschichtung!$O7,'Daten Umschichtung'!I125*Umschichtung!$N7,'Daten Umschichtung'!I125*Umschichtung!$K7)+J17","v":{"v":470555.26875,"d":"470,555"}}]
[null,"U3",0,0,0,{"$f":"'Daten Umschichtung'!E126+IF(F$111=Umschichtung!$O8,'Daten Umschichtung'!E126*Umschichtung!$N8,'Daten Umschichtung'!E126*Umschichtung!$K8)+F18","v":0},{"$f":"'Daten Umschichtung'!F126+IF(G$111=Umschichtung!$O8,'Daten Umschichtung'!F126*Umschichtung!$N8,'Daten Umschichtung'!F126*Umschichtung!$K8)+G18","v":0},{"$f":"'Daten Umschichtung'!G126+IF(H$111=Umschichtung!$O8,'Daten Umschichtung'!G126*Umschichtung!$N8,'Daten Umschichtung'!G126*Umschichtung!$K8)+H18","v":0},{"$f":"'Daten Umschichtung'!H126+IF(I$111=Umschichtung!$O8,'Daten Umschichtung'!H126*Umschichtung!$N8,'Daten Umschichtung'!H126*Umschichtung!$K8)+I18","v":0},{"$f":"'Daten Umschichtung'!I126+IF(J$111=Umschichtung!$O8,'Daten Umschichtung'!I126*Umschichtung!$N8,'Daten Umschichtung'!I126*Umschichtung!$K8)+J18","v":0}]
[null,"U4",0,0,0,{"$f":"'Daten Umschichtung'!E127+IF(F$111=Umschichtung!$O9,'Daten Umschichtung'!E127*Umschichtung!$N9,'Daten Umschichtung'!E127*Umschichtung!$K9)+F19","v":0},{"$f":"'Daten Umschichtung'!F127+IF(G$111=Umschichtung!$O9,'Daten Umschichtung'!F127*Umschichtung!$N9,'Daten Umschichtung'!F127*Umschichtung!$K9)+G19","v":0},{"$f":"'Daten Umschichtung'!G127+IF(H$111=Umschichtung!$O9,'Daten Umschichtung'!G127*Umschichtung!$N9,'Daten Umschichtung'!G127*Umschichtung!$K9)+H19","v":0},{"$f":"'Daten Umschichtung'!H127+IF(I$111=Umschichtung!$O9,'Daten Umschichtung'!H127*Umschichtung!$N9,'Daten Umschichtung'!H127*Umschichtung!$K9)+I19","v":0},{"$f":"'Daten Umschichtung'!I127+IF(J$111=Umschichtung!$O9,'Daten Umschichtung'!I127*Umschichtung!$N9,'Daten Umschichtung'!I127*Umschichtung!$K9)+J19","v":0}]
[null,"U5",0,0,0,{"$f":"'Daten Umschichtung'!E128+IF(F$111=Umschichtung!$O10,'Daten Umschichtung'!E128*Umschichtung!$N10,'Daten Umschichtung'!E128*Umschichtung!$K10)+F20","v":0},{"$f":"'Daten Umschichtung'!F128+IF(G$111=Umschichtung!$O10,'Daten Umschichtung'!F128*Umschichtung!$N10,'Daten Umschichtung'!F128*Umschichtung!$K10)+G20","v":0},{"$f":"'Daten Umschichtung'!G128+IF(H$111=Umschichtung!$O10,'Daten Umschichtung'!G128*Umschichtung!$N10,'Daten Umschichtung'!G128*Umschichtung!$K10)+H20","v":0},{"$f":"'Daten Umschichtung'!H128+IF(I$111=Umschichtung!$O10,'Daten Umschichtung'!H128*Umschichtung!$N10,'Daten Umschichtung'!H128*Umschichtung!$K10)+I20","v":0},{"$f":"'Daten Umschichtung'!I128+IF(J$111=Umschichtung!$O10,'Daten Umschichtung'!I128*Umschichtung!$N10,'Daten Umschichtung'!I128*Umschichtung!$K10)+J20","v":0}]
[null,"U6",0,0,0,{"$f":"'Daten Umschichtung'!E129+IF(F$111=Umschichtung!$O11,'Daten Umschichtung'!E129*Umschichtung!$N11,'Daten Umschichtung'!E129*Umschichtung!$K11)+F21","v":0},{"$f":"'Daten Umschichtung'!F129+IF(G$111=Umschichtung!$O11,'Daten Umschichtung'!F129*Umschichtung!$N11,'Daten Umschichtung'!F129*Umschichtung!$K11)+G21","v":0},{"$f":"'Daten Umschichtung'!G129+IF(H$111=Umschichtung!$O11,'Daten Umschichtung'!G129*Umschichtung!$N11,'Daten Umschichtung'!G129*Umschichtung!$K11)+H21","v":0},{"$f":"'Daten Umschichtung'!H129+IF(I$111=Umschichtung!$O11,'Daten Umschichtung'!H129*Umschichtung!$N11,'Daten Umschichtung'!H129*Umschichtung!$K11)+I21","v":0},{"$f":"'Daten Umschichtung'!I129+IF(J$111=Umschichtung!$O11,'Daten Umschichtung'!I129*Umschichtung!$N11,'Daten Umschichtung'!I129*Umschichtung!$K11)+J21","v":0}]
[null,null,{"$f":"C87","v":"Summe"},null,{"$f":"SUM(E112:E129)","v":{"v":7600000,"d":"7,600,000"}},{"$f":"SUM(F112:F129)","v":{"v":7651750,"d":"7,651,750"}},{"$f":"SUM(G112:G129)","v":{"v":6878300,"d":"6,878,300"}},{"v":6943932.75,"d":"6,943,933"},{"v":7010712.90125,"d":"7,010,713"},{"v":7078669.25038125,"d":"7,078,669"}]
[]
[null,null,"Risiko Umschichtung nach AK",{"$f":"D46","v":"Immobilien"},{"$f":"SUMIF($D$112:$D$129,\"Immobilien\",E$112:E$129)","v":{"v":500000,"d":"500,000"}},{"$f":"SUMIF($D$112:$D$129,\"Immobilien\",F$112:F$129)","v":{"v":505000,"d":"505,000"}},{"v":505000,"d":"505,000"},{"v":510050,"d":"510,050"},{"v":515150.5,"d":"515,151"},{"v":520302.005,"d":"520,302"}]
[{"$nulls":3},{"$f":"D47","v":"Beteiligungen"},{"$f":"SUMIF($D$112:$D$129,\"Beteiligungen\",E$112:E$129)","v":0},{"$f":"SUMIF($D$112:$D$129,\"Beteiligungen\",F$112:F$129)","v":0},0,0,0,0]
[{"$nulls":3},"Wertpapiere",{"$f":"SUM(E135:E138)","v":{"v":6100000,"d":"6,100,000"}},{"$f":"SUM(F135:F138)","v":{"v":6646750,"d":"6,646,750"}},{"v":6373300,"d":"6,373,300"},{"v":6433882.75,"d":"6,433,883"},{"v":6495562.40125,"d":"6,495,562"},{"v":6558367.24538125,"d":"6,558,367"}]
[{"$nulls":3},{"$f":"D49","v":" davon Aktien"},{"$f":"SUMIF($D$112:$D$129,\"Aktien\",E$112:E$129)","v":{"v":650000,"d":"650,000"}},{"$f":"SUMIF($D$112:$D$129,\"Aktien\",F$112:F$129)","v":{"v":1169500,"d":"1,169,500"}},{"v":1418650,"d":"1,418,650"},{"v":1454459.5,"d":"1,454,460"},{"v":1491242.035,"d":"1,491,242"},{"v":1529025.2773,"d":"1,529,025"}]
[{"$nulls":3}," davon Renten",{"$f":"SUMIF($D$112:$D$129,\"Renten\",E$112:E$129)","v":{"v":5450000,"d":"5,450,000"}},{"$f":"SUMIF($D$112:$D$129,\"Renten\",F$112:F$129)","v":{"v":5477250,"d":"5,477,250"}},{"v":4954650,"d":"4,954,650"},{"v":4979423.25,"d":"4,979,423"},{"v":5004320.36625,"d":"5,004,320"},{"v":5029341.96808125,"d":"5,029,342"}]
[{"$nulls":3}," davon Liquidität",{"$f":"SUMIF($D$112:$D$129,\"LIquidität\",E$112:E$129)","v":0},{"$f":"SUMIF($D$112:$D$129,\"LIquidität\",F$112:F$129)","v":0},0,0,0,0]
[{"$nulls":3}," davon Alternative Investments",{"$f":"SUMIF($D$112:$D$129,\"Alternative Investments\",E$112:E$129)","v":0},{"$f":"SUMIF($D$112:$D$129,\"Alternative Investments\",F$112:F$129)","v":0},0,0,0,0]
[{"$nulls":3},"Spar- und Termineinlagen",{"$f":"SUMIF($D$112:$D$129,\"Spar- u. Termineinlagen\",E$112:E$129)","v":0},{"$f":"SUMIF($D$112:$D$129,\"Spar- u. Termineinlagen\",F$112:F$129)","v":0},0,0,0,0]
[{"$nulls":3},"Kontoguthaben Investitionsvermögen",{"$f":"SUMIF($D$112:$D$129,\"Kontoguthaben\",E$112:E$129)","v":{"v":1000000,"d":"1,000,000"}},{"$f":"SUMIF($D$112:$D$129,\"Kontoguthaben\",F$112:F$129)","v":{"v":500000,"d":"500,000"}},0,0,0,0]
[{"$nulls":3},"Sonstiges Vermögen",{"$f":"SUMIF($D$112:$D$129,\"Sonstiges Vermögen\",E$112:E$129)","v":0},{"$f":"SUMIF($D$112:$D$129,\"Sonstiges Vermögen\",F$112:F$129)","v":0},0,0,0,0]
[{"$nulls":3},"Verbindlichkeiten",{"$f":"SUMIF($D$112:$D$129,\"Verbindlichkeiten\",E$112:E$129)","v":0},{"$f":"SUMIF($D$112:$D$129,\"Verbindlichkeiten\",F$112:F$129)","v":0},0,0,0,0]
[{"$nulls":3},"Summe",{"$f":"SUM(E132:E134)+SUM(E139:E142)","v":{"v":7600000,"d":"7,600,000"}},{"$f":"SUM(F132:F134)+SUM(F139:F142)","v":{"v":7651750,"d":"7,651,750"}},{"v":6878300,"d":"6,878,300"},{"v":6943932.75,"d":"6,943,933"},{"v":7010712.90125,"d":"7,010,713"},{"v":7078669.25038125,"d":"7,078,669"}]
[]
[null,null,"Risiko Grafik",null,null,{"$f":"F111","v":2019},{"$f":"G111","v":2020},2021,2022,2023]
[{"$nulls":3},"Vermögen Worst Case Basis",null,{"$f":"'Daten Projektion'!I184","v":{"v":7651750,"d":"7,651,750"}},{"$f":"'Daten Projektion'!J184","v":{"v":6928300,"d":"6,928,300"}},{"$f":"'Daten Projektion'!K184","v":{"v":6972182.75,"d":"6,972,183"}},{"$f":"'Daten Projektion'!L184","v":{"v":7016661.65125,"d":"7,016,662"}},{"$f":"'Daten Projektion'!M184","v":{"v":7061750.48163125,"d":"7,061,750"}}]
[{"$nulls":3},"Vermögen Worst Case Umschichtung",null,{"$f":"F143","v":{"v":7651750,"d":"7,651,750"}},{"$f":"G143","v":{"v":6878300,"d":"6,878,300"}},{"$f":"H143","v":{"v":6943932.75,"d":"6,943,933"}},{"$f":"I143","v":{"v":7010712.90125,"d":"7,010,713"}},{"$f":"J143","v":{"v":7078669.25038125,"d":"7,078,669"}}]
[{"$nulls":3},"Maximalverlust Investitionsvermögen (Ziel)",null,{"$f":"'Daten Projektion'!I185","v":{"v":7341074.63813493,"d":"7,341,075"}},{"$f":"'Daten Projektion'!J185","v":{"v":7487896.130897629,"d":"7,487,896"}},{"$f":"'Daten Projektion'!K185","v":{"v":7637654.053515582,"d":"7,637,654"}},{"$f":"'Daten Projektion'!L185","v":{"v":7790407.134585894,"d":"7,790,407"}},{"$f":"'Daten Projektion'!M185","v":{"v":7946215.277277612,"d":"7,946,215"}}]
[{"$nulls":3},"Maximalverlust Grundstock (Ziel)",null,{"$f":"'Daten Projektion'!I186","v":{"v":6000000,"d":"6,000,000"}},{"$f":"'Daten Projektion'!J186","v":{"v":6000000,"d":"6,000,000"}},{"$f":"'Daten Projektion'!K186","v":{"v":6000000,"d":"6,000,000"}},{"$f":"'Daten Projektion'!L186","v":{"v":6000000,"d":"6,000,000"}},{"$f":"'Daten Projektion'!M186","v":{"v":6000000,"d":"6,000,000"}}]
[]
[null,null,"Zielerreichung Risiko",null,null,{"$f":"F3","v":2019},{"$f":"G3","v":2020},2021,2022,2023]
[{"$nulls":3},"Risikoziel Maximalverlust",null,{"$f":"'Daten VE'!H45*Anlageziele!$E$21*-1","v":{"v":-378796.4209563948,"d":"-378,796 "}},{"$f":"'Daten VE'!I45*Anlageziele!$E$21*-1","v":{"v":-386372.3493755227,"d":"-386,372 "}},{"$f":"'Daten VE'!J45*Anlageziele!$E$21*-1","v":{"v":-394099.7963630331,"d":"-394,100 "}},{"$f":"'Daten VE'!K45*Anlageziele!$E$21*-1","v":{"v":-401981.79229029384,"d":"-401,982 "}},{"$f":"'Daten VE'!L45*Anlageziele!$E$21*-1","v":{"v":-410021.4281360997,"d":"-410,021 "}}]
[{"$nulls":3},"Maximalverlust Basisszenario Worst Case ",null,{"$f":"'Daten Projektion'!I140-'Daten Projektion'!H140","v":{"v":51750,"d":"51,750"}},{"$f":"'Daten Projektion'!J140-'Daten Projektion'!I140","v":{"v":-723450,"d":"-723,450 "}},{"$f":"'Daten Projektion'!K140-'Daten Projektion'!J140","v":{"v":43882.75,"d":"43,883"}},{"$f":"'Daten Projektion'!L140-'Daten Projektion'!K140","v":{"v":44478.90125000011,"d":"44,479"}},{"$f":"'Daten Projektion'!M140-'Daten Projektion'!L140","v":{"v":45088.83038125001,"d":"45,089"}}]
[{"$nulls":3},"Maximalverlust Umschichtung Worst Case",null,{"$f":"F143-E143","v":{"v":51750,"d":"51,750"}},{"$f":"G143-F143","v":{"v":-773450,"d":"-773,450 "}},{"v":65632.75,"d":"65,633"},{"v":66780.15125000011,"d":"66,780"},{"v":67956.34913124982,"d":"67,956"}]
[{"$nulls":3},"Zielabweichung Risiko Basisszenario",{"$f":"MIN(F155:J155)","v":{"v":-0.8724165980543941,"d":"-87.2%"}},{"$f":"(F153-F152)/F152*-1","v":{"v":1.1366169191074729,"d":"113.7%"}},{"$f":"(G153-G152)/G152*-1","v":{"v":-0.8724165980543941,"d":"-87.2%"}},{"v":1.1113493343690453,"d":"111.1%"},{"v":1.1106490445663753,"d":"111.1%"},{"v":1.1099670097395093,"d":"111.0%"}]
[{"$nulls":3},"Zielabweichung Risiko Umschichtung",{"$f":"MIN(F156:J156)","v":{"v":-1.0018254444193395,"d":"-100.2%"}},{"$f":"(F154-F152)/F152*-1","v":{"v":1.1366169191074729,"d":"113.7%"}},{"$f":"(G154-G152)/G152*-1","v":{"v":-1.0018254444193395,"d":"-100.2%"}},{"v":1.1665384012011542,"d":"116.7%"},{"v":1.1661273036012894,"d":"116.6%"},{"v":1.1657385308864707,"d":"116.6%"}]
[]
[null,null,"Nachhaltigkeit Umschichtung"]
[]
[null,"Nr. ","Vermögensgegenstand","Nachhaltigkeitskonzept","Wert",{"$f":"F3","v":2019},{"$f":"G3","v":2020},2021,2022,2023]
[null,{"$f":"B4","v":1},{"$f":"C4","v":"Vermögensverwaltung A-Bank Aktien"},{"$f":"Vermentw.!H5","v":"Engagement"},{"$f":"E4","v":{"v":650000,"d":"650,000"}},{"$f":"F25","v":{"v":669500,"d":"669,500"}},{"$f":"G25","v":{"v":689585,"d":"689,585"}},{"v":710272.55,"d":"710,273"},{"v":731580.7265000001,"d":"731,581"},{"v":753528.1482950001,"d":"753,528"}]
[null,{"$f":"B5","v":2},"Vermögensverwaltung A-Bank Renten",{"$f":"Vermentw.!H6","v":"Best in Class"},{"$f":"E5","v":{"v":5200000,"d":"5,200,000"}},{"$f":"F26","v":{"v":5226000,"d":"5,226,000"}},{"v":5252130,"d":"5,252,130"},{"v":5278390.65,"d":"5,278,391"},{"v":5304782.603250001,"d":"5,304,783"},{"v":5331306.516266251,"d":"5,331,307"}]
[null,3,"Stiftungsfonds Xy",{"$f":"Vermentw.!H7","v":"Ausschluss"},{"v":250000,"d":"250,000"},{"v":251250,"d":"251,250"},{"v":252506.25,"d":"252,506"},{"v":253768.78125,"d":"253,769"},{"v":255037.62515625,"d":"255,038"},{"v":256312.81328203125,"d":"256,313"}]
[null,4,"Immobilie",{"$f":"Vermentw.!H8","v":"Zweckkonform"},{"v":500000,"d":"500,000"},{"v":505000,"d":"505,000"},{"v":510050,"d":"510,050"},{"v":515150.5,"d":"515,151"},{"v":520302.005,"d":"520,302"},{"v":525505.02505,"d":"525,505"}]
[null,5,"Bankguthaben B-Bank",{"$f":"Vermentw.!H9","v":"Keine"},{"v":1000000,"d":"1,000,000"},{"v":500000,"d":"500,000"},0,0,0,0]
[null,6,0,{"$f":"Vermentw.!H10","v":"Bitte ausw."},0,0,0,0,0,0]
[null,7,0,{"$f":"Vermentw.!H11","v":"Bitte ausw."},0,0,0,0,0,0]
[null,8,0,{"$f":"Vermentw.!H12","v":"Bitte ausw."},0,0,0,0,0,0]
[null,9,0,{"$f":"Vermentw.!H13","v":"Bitte ausw."},0,0,0,0,0,0]
[null,10,0,{"$f":"Vermentw.!H14","v":"Bitte ausw."},0,0,0,0,0,0]
[null,11,0,{"$f":"Vermentw.!H15","v":"Bitte ausw."},0,0,0,0,0,0]
[null,12,0,{"$f":"Vermentw.!H16","v":"Bitte ausw."},0,0,0,0,0,0]
[null,"U1","Aufstockung VV Aktien",{"$f":"Umschichtung!F6","v":"Best in Class"},0,0,{"v":500000,"d":"500,000"},{"v":515000,"d":"515,000"},{"v":530450,"d":"530,450"},{"v":546363.5,"d":"546,364"}]
[null,"U2","ABC Stiftungsfonds",{"$f":"Umschichtung!F7","v":"Best in Class"},0,{"v":500000,"d":"500,000"},{"v":507500,"d":"507,500"},{"v":515112.5,"d":"515,113"},{"v":522839.1875,"d":"522,839"},{"v":530681.7753125,"d":"530,682"}]
[null,"U3",0,{"$f":"Umschichtung!F8","v":"Bitte ausw."},0,0,0,0,0,0]
[null,"U4",0,{"$f":"Umschichtung!F9","v":"Bitte ausw."},0,0,0,0,0,0]
[null,"U5",0,{"$f":"Umschichtung!F10","v":"Bitte ausw."},0,0,0,0,0,0]
[null,"U6",0,{"$f":"Umschichtung!F11","v":"Bitte ausw."},0,0,0,0,0,0]
[]
[null,null,"Nachhaltigkeit Umschichtung","Bitte auswählen",{"$f":"SUMIF($D$25:$D$36,$D180,E$25:E$42)","v":0},{"$f":"SUMIF($D$161:$D$178,\"Bitte ausw.\",F$161:F$178)","v":0},{"$f":"SUMIF($D$161:$D$178,\"Bitte ausw.\",G$161:G$178)","v":0},0,0,0]
[{"$nulls":3},"Keine",{"$f":"SUMIF($D$25:$D$36,$D181,E$25:E$42)","v":0},{"$f":"SUMIF($D$161:$D$178,\"Keine\",F$161:F$178)","v":{"v":500000,"d":"500,000"}},{"$f":"SUMIF($D$161:$D$178,\"Keine\",G$161:G$178)","v":0},0,0,0]
[{"$nulls":3},"Ausschluss",null,{"$f":"SUMIF($D$161:$D$178,\"Ausschluss\",F$161:F$178)","v":{"v":251250,"d":"251,250"}},{"$f":"SUMIF($D$161:$D$178,\"Ausschluss\",G$161:G$178)","v":{"v":252506.25,"d":"252,506"}},{"v":253768.78125,"d":"253,769"},{"v":255037.62515625,"d":"255,038"},{"v":256312.81328203125,"d":"256,313"}]
[{"$nulls":3},"Zweckkonform",{"$f":"SUMIF($D$25:$D$42,\"Aktien\",E$25:E$42)","v":{"v":650000,"d":"650,000"}},{"$f":"SUMIF($D$161:$D$178,\"Zweckkonform\",F$161:F$178)","v":{"v":505000,"d":"505,000"}},{"$f":"SUMIF($D$161:$D$178,\"Zweckkonform\",G$161:G$178)","v":{"v":510050,"d":"510,050"}},{"v":515150.5,"d":"515,151"},{"v":520302.005,"d":"520,302"},{"v":525505.02505,"d":"525,505"}]
[{"$nulls":3},"Best in Class",{"$f":"SUMIF($D$25:$D$42,\"Renten\",E$25:E$42)","v":{"v":5450000,"d":"5,450,000"}},{"$f":"SUMIF($D$161:$D$178,\"Best in Class\",F$161:F$178)","v":{"v":5726000,"d":"5,726,000"}},{"$f":"SUMIF($D$161:$D$178,\"Best in Class\",G$161:G$178)","v":{"v":6259630,"d":"6,259,630"}},{"v":6308503.15,"d":"6,308,503"},{"v":6358071.790750001,"d":"6,358,072"},{"v":6408351.791578751,"d":"6,408,352"}]
[{"$nulls":3},"Engagement",{"$f":"SUMIF($D$25:$D$42,\"Liquidität\",E$25:E$42)","v":0},{"$f":"SUMIF($D$161:$D$178,\"Engagement\",F$161:F$178)","v":{"v":669500,"d":"669,500"}},{"$f":"SUMIF($D$161:$D$178,\"Engagement\",G$161:G$178)","v":{"v":689585,"d":"689,585"}},{"v":710272.55,"d":"710,273"},{"v":731580.7265000001,"d":"731,581"},{"v":753528.1482950001,"d":"753,528"}]
[{"$nulls":3},"Impact Investing",{"$f":"SUMIF($D$25:$D$42,\"Alternative Investments\",E$25:E$42)","v":0},{"$f":"SUMIF($D$161:$D$178,\"Impact Investing\",F$161:F$178)","v":0},{"$f":"SUMIF($D$161:$D$178,\"Impact Investing\",G$161:G$178)","v":0},0,0,0]
[{"$nulls":3},"Summe",{"$f":"SUM(E180:E181)+SUM(#REF!)","v":{"$error":"#REF!"}},{"$f":"SUM(F180:F186)","v":{"v":7651750,"d":"7,651,750"}},{"$f":"SUM(G180:G186)","v":{"v":7711771.25,"d":"7,711,771"}},{"v":7787694.98125,"d":"7,787,695"},{"v":7864992.14740625,"d":"7,864,992"},{"v":7943697.778205782,"d":"7,943,698"}]
[]
[null,null,"Zielerreichung Nachhaltigkeit",null,null,{"$f":"F3","v":2019},{"$f":"G3","v":2020},2021,2022,2023]
[{"$nulls":3},"Nachhaltigkeitsziel",null,{"$f":"IF(Anlageziele!$L$19<='Daten Umschichtung'!F189,'Daten Projektion'!I18*Anlageziele!$M$20,'Daten Projektion'!I170)","v":{"v":6651750,"d":"6,651,750"}},{"$f":"IF(Anlageziele!$L$19<='Daten Umschichtung'!G189,'Daten Projektion'!J18*Anlageziele!$M$20,'Daten Projektion'!J170)","v":{"v":6704271.25,"d":"6,704,271"}},{"$f":"IF(Anlageziele!$L$19<='Daten Umschichtung'!H189,'Daten Projektion'!K18*Anlageziele!$M$20,'Daten Projektion'!K170)","v":{"v":5818186.8609375,"d":"5,818,187"}},{"$f":"IF(Anlageziele!$L$19<='Daten Umschichtung'!I189,'Daten Projektion'!L18*Anlageziele!$M$20,'Daten Projektion'!L170)","v":{"v":5858777.219929688,"d":"5,858,777"}},{"$f":"IF(Anlageziele!$L$19<='Daten Umschichtung'!J189,'Daten Projektion'!M18*Anlageziele!$M$20,'Daten Projektion'!M170)","v":{"v":5899989.377169962,"d":"5,899,989"}}]
[{"$nulls":3},"Nachhaltigkeit Basisszenario",null,{"$f":"'Daten Projektion'!I170","v":{"v":6651750,"d":"6,651,750"}},{"$f":"'Daten Projektion'!J170","v":{"v":6704271.25,"d":"6,704,271"}},{"$f":"'Daten Projektion'!K170","v":{"v":6757582.48125,"d":"6,757,582"}},{"$f":"'Daten Projektion'!L170","v":{"v":6811702.95990625,"d":"6,811,703"}},{"$f":"'Daten Projektion'!M170","v":{"v":6866652.502893282,"d":"6,866,653"}}]
[{"$nulls":3},"Nachhaltigkeit Umschichtung",null,{"$f":"SUM(F182:F186)","v":{"v":7151750,"d":"7,151,750"}},{"$f":"SUM(G182:G186)","v":{"v":7711771.25,"d":"7,711,771"}},{"v":7787694.98125,"d":"7,787,695"},{"v":7864992.14740625,"d":"7,864,992"},{"v":7943697.778205782,"d":"7,943,698"}]
[{"$nulls":3},"Zielabweichung Basisszenario",null,{"$f":"(F191-F190)/F190","v":{"v":0,"d":"0.0%"}},{"$f":"(G191-G190)/G190","v":{"v":0,"d":"0.0%"}},{"v":0.16145848230132856,"d":"16.1%"},{"v":0.16264925328360563,"d":"16.3%"},{"v":0.16384150274300963,"d":"16.4%"}]
[{"$nulls":3},"Zielabweichung Umschichtung",null,{"$f":"(F192-F190)/F190","v":{"v":0.07516818882249032,"d":"7.5%"}},{"$f":"(G192-G190)/G190","v":{"v":0.15027733252887104,"d":"15.0%"}},{"v":0.33850891478503453,"d":"33.9%"},{"v":0.34242894927836826,"d":"34.2%"},{"v":0.3463918780843843,"d":"34.6%"}]

{"sheet":"Zahlen Umschichtung","index":18,"n_rows":110,"n_cols":11,"rows_kept":110,"merged":[[33,1,37,1]]}
[]
[null,null,"Analyse Umschichtung"]
[]
[null,null,"Beschreibung","Einh.","Bestand",{"$f":"Einstellungen!D7","v":2019},{"$f":"F4+1","v":2020},2021,2022,2023]
[]
[null,null,"Vermögen",{"$f":"Einstellungen!D9","v":"EUR "},{"$f":"SUM(E7:E9)+SUM(E14:E17)","v":{"v":7600000,"d":"7,600,000"}},{"v":7651750,"d":"7,651,750"},{"v":7711771.25,"d":"7,711,771"},{"v":7787694.98125,"d":"7,787,695"},{"v":7864992.14740625,"d":"7,864,992"},{"v":7943697.778205783,"d":"7,943,698"}]
[null,null,"Immobilien (Verkehrswert)",{"$f":"$D$6","v":"EUR "},{"$f":"'Daten Umschichtung'!E46","v":{"v":500000,"d":"500,000"}},{"$f":"'Daten Umschichtung'!F46","v":{"v":505000,"d":"505,000"}},{"$f":"'Daten Umschichtung'!G46","v":{"v":510050,"d":"510,050"}},{"$f":"'Daten Umschichtung'!H46","v":{"v":515150.5,"d":"515,151"}},{"$f":"'Daten Umschichtung'!I46","v":{"v":520302.005,"d":"520,302"}},{"$f":"'Daten Umschichtung'!J46","v":{"v":525505.02505,"d":"525,505"}}]
[null,null,"Beteiligungen","EUR ",{"$f":"'Daten Umschichtung'!E47","v":0},{"$f":"'Daten Umschichtung'!F47","v":0},{"$f":"'Daten Umschichtung'!G47","v":0},{"$f":"'Daten Umschichtung'!H47","v":0},{"$f":"'Daten Umschichtung'!I47","v":0},{"$f":"'Daten Umschichtung'!J47","v":0}]
[null,null,"Wertpapiere","EUR ",{"$f":"'Daten Umschichtung'!E48","v":{"v":6100000,"d":"6,100,000"}},{"$f":"'Daten Umschichtung'!F48","v":{"v":6646750,"d":"6,646,750"}},{"$f":"'Daten Umschichtung'!G48","v":{"v":7201721.25,"d":"7,201,721"}},{"$f":"'Daten Umschichtung'!H48","v":{"v":7272544.48125,"d":"7,272,544"}},{"$f":"'Daten Umschichtung'!I48","v":{"v":7344690.14240625,"d":"7,344,690"}},{"$f":"'Daten Umschichtung'!J48","v":{"v":7418192.753155783,"d":"7,418,193"}}]
[null,null," davon Aktien","EUR ",{"$f":"'Daten Umschichtung'!E49","v":{"v":650000,"d":"650,000"}},{"$f":"'Daten Umschichtung'!F49","v":{"v":1169500,"d":"1,169,500"}},{"$f":"'Daten Umschichtung'!G49","v":{"v":1697085,"d":"1,697,085"}},{"$f":"'Daten Umschichtung'!H49","v":{"v":1740385.05,"d":"1,740,385"}},{"$f":"'Daten Umschichtung'!I49","v":{"v":1784869.914,"d":"1,784,870"}},{"$f":"'Daten Umschichtung'!J49","v":{"v":1830573.4236075003,"d":"1,830,573"}}]
[null,null," davon Renten","EUR ",{"$f":"'Daten Umschichtung'!E50","v":{"v":5450000,"d":"5,450,000"}},{"$f":"'Daten Umschichtung'!F50","v":{"v":5477250,"d":"5,477,250"}},{"$f":"'Daten Umschichtung'!G50","v":{"v":5504636.25,"d":"5,504,636"}},{"$f":"'Daten Umschichtung'!H50","v":{"v":5532159.43125,"d":"5,532,159"}},{"$f":"'Daten Umschichtung'!I50","v":{"v":5559820.2284062505,"d":"5,559,820"}},{"$f":"'Daten Umschichtung'!J50","v":{"v":5587619.329548283,"d":"5,587,619"}}]
[null,null," davon Liquidität (Cashbestand in Fonds)","EUR ",{"$f":"'Daten Umschichtung'!E51","v":0},{"$f":"'Daten Umschichtung'!F51","v":0},{"$f":"'Daten Umschichtung'!G51","v":0},{"$f":"'Daten Umschichtung'!H51","v":0},{"$f":"'Daten Umschichtung'!I51","v":0},{"$f":"'Daten Umschichtung'!J51","v":0}]
[null,null," davon Alternative Investments","EUR ",{"$f":"'Daten Umschichtung'!E52","v":0},{"$f":"'Daten Umschichtung'!F52","v":0},{"$f":"'Daten Umschichtung'!G52","v":0},{"$f":"'Daten Umschichtung'!H52","v":0},{"$f":"'Daten Umschichtung'!I52","v":0},{"$f":"'Daten Umschichtung'!J52","v":0}]
[null,null,"Spar- und Termineinlagen","EUR ",{"$f":"'Daten Umschichtung'!E53","v":0},{"$f":"'Daten Umschichtung'!F53","v":0},{"$f":"'Daten Umschichtung'!G53","v":0},{"$f":"'Daten Umschichtung'!H53","v":0},{"$f":"'Daten Umschichtung'!I53","v":0},{"$f":"'Daten Umschichtung'!J53","v":0}]
[null,null,"Kontoguthaben Investitionsvermögen","EUR ",{"$f":"'Daten Umschichtung'!E54","v":{"v":1000000,"d":"1,000,000"}},{"$f":"'Daten Umschichtung'!F54","v":{"v":500000,"d":"500,000"}},{"$f":"'Daten Umschichtung'!G54","v":0},{"$f":"'Daten Umschichtung'!H54","v":0},{"$f":"'Daten Umschichtung'!I54","v":0},{"$f":"'Daten Umschichtung'!J54","v":0}]
[null,null,"Sonstiges Vermögen","EUR ",{"$f":"'Daten Umschichtung'!E55","v":0},{"$f":"'Daten Umschichtung'!F55","v":0},{"$f":"'Daten Umschichtung'!G55","v":0},{"$f":"'Daten Umschichtung'!H55","v":0},{"$f":"'Daten Umschichtung'!I55","v":0},{"$f":"'Daten Umschichtung'!J55","v":0}]
[null,null,"Verbindlichkeiten","EUR ",{"$f":"'Daten Umschichtung'!E56","v":0},{"$f":"'Daten Umschichtung'!F56","v":0},{"$f":"'Daten Umschichtung'!G56","v":0},{"$f":"'Daten Umschichtung'!H56","v":0},{"$f":"'Daten Umschichtung'!I56","v":0},{"$f":"'Daten Umschichtung'!J56","v":0}]
[null,null,"Kennzahlen"]
[null,null,"Aktienquote Wertpapiere","%",{"$f":"E10/E9","v":{"v":0.10655737704918032,"d":"10.7%"}},{"v":0.17595065257456652,"d":"17.6%"},{"v":0.23564991494220913,"d":"23.6%"},{"v":0.23930895912524744,"d":"23.9%"},{"v":0.24301500531583287,"d":"24.3%"},{"v":0.24676811246630842,"d":"24.7%"}]
[null,null,"Aktienquote Gesamtvermögen","%",{"$f":"E10/E6","v":{"v":0.08552631578947369,"d":"8.6%"}},{"v":0.15284085339954911,"d":"15.3%"},{"v":0.22006422973191794,"d":"22.0%"},{"v":0.22347884119630113,"d":"22.3%"},{"v":0.22693855003893704,"d":"22.7%"},{"v":0.23044348799747086,"d":"23.0%"}]
[null,null,"Bestand freie Rücklage",{"$f":"D6","v":"EUR "},{"$f":"IF(Einstellungen!D9=\"TEUR\",Einstellungen!D29/1000,Einstellungen!D29)","v":{"v":10000,"d":"10,000"}},{"$f":"E21+E22","v":{"v":10000,"d":"10,000"}},{"v":21280,"d":"21,280"},{"v":33994.35,"d":"33,994"},{"v":46643.19325,"d":"46,643"},{"v":59226.80002124999,"d":"59,227"}]
[null,null,"Veränderung freie Rücklage inkl. Tilgung",{"$f":"D7","v":"EUR "},0,{"$f":"F49","v":{"v":11280,"d":"11,280"}},{"$f":"G49","v":{"v":12714.349999999999,"d":"12,714"}},{"v":12648.843249999998,"d":"12,649"},{"v":12583.606771249993,"d":"12,584"},{"v":12518.774352456268,"d":"12,519"}]
[null,null,"Bestand Umschichtungsrücklage",{"$f":"D8","v":"EUR "},{"$f":"IF(Einstellungen!D12=\"TEUR\",Einstellungen!D28/1000,Einstellungen!D28)","v":{"v":20000,"d":"20,000"}},{"$f":"E23+E24","v":{"v":20000,"d":"20,000"}},{"$f":"F23+F24","v":{"v":20000,"d":"20,000"}},{"v":20000,"d":"20,000"},{"v":20000,"d":"20,000"},{"v":20000,"d":"20,000"}]
[null,null,"Veränderung Umschichtungsrücklage",{"$f":"D9","v":"EUR "},0,{"$f":"IF(Einstellungen!$R$30=TRUE,(E10*Einstellungen!$D$37+'Zahlen Umschichtung'!E11*Einstellungen!$D$38+'Zahlen Umschichtung'!E12*Einstellungen!$D$39+'Zahlen Umschichtung'!E13*Einstellungen!$D$40+'Zahlen Umschichtung'!#REF!*Einstellungen!$D$41)-E9*Einstellungen!#REF!+IF(F4=Einstellungen!$T$40,Einstellungen!$S$40,0)+IF(F4=Einstellungen!$T$41,Einstellungen!$S$41,0)+IF(F4=Einstellungen!$T$42,Einstellungen!$S$42,0),0)","v":0},{"$f":"IF(Einstellungen!$R$30=TRUE,(F10*Einstellungen!$D$37+'Zahlen Umschichtung'!F11*Einstellungen!$D$38+'Zahlen Umschichtung'!F12*Einstellungen!$D$39+'Zahlen Umschichtung'!F13*Einstellungen!$D$40+'Zahlen Umschichtung'!#REF!*Einstellungen!$D$41)-F9*Einstellungen!#REF!+IF(G4=Einstellungen!$T$40,Einstellungen!$S$40,0)+IF(G4=Einstellungen!$T$41,Einstellungen!$S$41,0)+IF(G4=Einstellungen!$T$42,Einstellungen!$S$42,0),0)","v":0},{"$f":"IF(Einstellungen!$R$30=TRUE,(G10*Einstellungen!$D$37+'Zahlen Umschichtung'!G11*Einstellungen!$D$38+'Zahlen Umschichtung'!G12*Einstellungen!$D$39+'Zahlen Umschichtung'!G13*Einstellungen!$D$40+'Zahlen Umschichtung'!#REF!*Einstellungen!$D$41)-G9*Einstellungen!#REF!+IF(H4=Einstellungen!$T$40,Einstellungen!$S$40,0)+IF(H4=Einstellungen!$T$41,Einstellungen!$S$41,0)+IF(H4=Einstellungen!$T$42,Einstellungen!$S$42,0),0)","v":0},{"$f":"IF(Einstellungen!$R$30=TRUE,(H10*Einstellungen!$D$37+'Zahlen Umschichtung'!H11*Einstellungen!$D$38+'Zahlen Umschichtung'!H12*Einstellungen!$D$39+'Zahlen Umschichtung'!H13*Einstellungen!$D$40+'Zahlen Umschichtung'!#REF!*Einstellungen!$D$41)-H9*Einstellungen!#REF!+IF(I4=Einstellungen!$T$40,Einstellungen!$S$40,0)+IF(I4=Einstellungen!$T$41,Einstellungen!$S$41,0)+IF(I4=Einstellungen!$T$42,Einstellungen!$S$42,0),0)","v":0},{"$f":"IF(Einstellungen!$R$30=TRUE,(I10*Einstellungen!$D$37+'Zahlen Umschichtung'!I11*Einstellungen!$D$38+'Zahlen Umschichtung'!I12*Einstellungen!$D$39+'Zahlen Umschichtung'!I13*Einstellungen!$D$40+'Zahlen Umschichtung'!#REF!*Einstellungen!$D$41)-I9*Einstellungen!#REF!+IF(J4=Einstellungen!$T$40,Einstellungen!$S$40,0)+IF(J4=Einstellungen!$T$41,Einstellungen!$S$41,0)+IF(J4=Einstellungen!$T$42,Einstellungen!$S$42,0),0)","v":0}]
[null,null,"Grundstockvermögen (Soll)",{"$f":"D10","v":"EUR "},{"$f":"'Daten Umschichtung'!E60","v":{"v":7575928.4191278955,"d":"7,575,928"}},{"$f":"'Daten Umschichtung'!F60","v":{"v":7727446.987510453,"d":"7,727,447"}},{"$f":"'Daten Umschichtung'!G60","v":{"v":7881995.927260662,"d":"7,881,996"}},{"$f":"'Daten Umschichtung'!H60","v":{"v":8039635.845805876,"d":"8,039,636"}},{"$f":"'Daten Umschichtung'!I60","v":{"v":8200428.562721994,"d":"8,200,429"}},{"$f":"'Daten Umschichtung'!J60","v":{"v":8364437.133976433,"d":"8,364,437"}}]
[null,null,"Delta absolut",{"$f":"D12","v":"EUR "},{"$f":"E6-E25","v":{"v":24071.580872104503,"d":"24,072"}},{"v":-75696.98751045298,"d":"-75,697 "},{"v":-170224.67726066243,"d":"-170,225 "},{"v":-251940.86455587577,"d":"-251,941 "},{"v":-335436.41531574354,"d":"-335,436 "},{"v":-420739.3557706503,"d":"-420,739 "}]
[null,null,"Delta Prozent","%",{"$f":"E26/E6","v":{"v":0.003167313272645329,"d":"0.3%"}},{"v":-0.00989276799561577,"d":"-1.0%"},{"v":-0.022073356657287057,"d":"-2.2%"},{"v":-0.03235114692633183,"d":"-3.2%"},{"v":-0.042649300727701955,"d":"-4.3%"},{"v":-0.052965176611449755,"d":"-5.3%"}]
[]
[null,null,"Liquidität Saldo",{"$f":"D6","v":"EUR "},{"$f":"E31-E39","v":0},{"$f":"F31-F39","v":0},{"$f":"G31-G39","v":{"v":7500,"d":"7,500"}},{"v":17612.499999999985,"d":"17,613"},{"v":18026.6875,"d":"18,027"},{"v":18451.5878125,"d":"18,452"}]
[]
[null,null,"Einnahmen",{"$f":"D29","v":"EUR "},{"$f":"SUM(E32:E37)","v":0},{"$f":"SUM(F32:F38)","v":{"v":63500,"d":"63,500"}},{"$f":"SUM(G32:G38)","v":{"v":71748.75,"d":"71,749"}},{"v":82626.43125,"d":"82,626"},{"v":83822.68403125,"d":"83,823"},{"v":85046.99972015627,"d":"85,047"}]
[null,null,"Spenden",{"$f":"$D$31","v":"EUR "},0,{"$f":"'Einn._Ausg.'!C7","v":{"v":5000,"d":"5,000"}},{"$f":"'Einn._Ausg.'!D7","v":{"v":5000,"d":"5,000"}},{"$f":"'Einn._Ausg.'!E7","v":{"v":5000,"d":"5,000"}},{"$f":"'Einn._Ausg.'!F7","v":{"v":5000,"d":"5,000"}},{"$f":"'Einn._Ausg.'!G7","v":{"v":5000,"d":"5,000"}}]
[null,null,"Zustiftungen",{"$f":"$D$31","v":"EUR "},0,{"$f":"'Einn._Ausg.'!C8","v":0},{"$f":"'Einn._Ausg.'!D8","v":0},{"$f":"'Einn._Ausg.'!E8","v":0},{"$f":"'Einn._Ausg.'!F8","v":0},{"$f":"'Einn._Ausg.'!G8","v":0}]
[null,"Ordtl. Erträge","Mieterträge (brutto)","EUR ",0,{"$f":"'Daten Umschichtung'!F89","v":{"v":10000,"d":"10,000"}},{"$f":"'Daten Umschichtung'!G89","v":{"v":10100,"d":"10,100"}},{"$f":"'Daten Umschichtung'!H89","v":{"v":10201,"d":"10,201"}},{"$f":"'Daten Umschichtung'!I89","v":{"v":10303.01,"d":"10,303"}},{"$f":"'Daten Umschichtung'!J89","v":{"v":10406.0401,"d":"10,406"}}]
[null,null,"Erträge aus Beteiligungen","EUR ",0,{"$f":"'Daten Umschichtung'!F90","v":0},{"$f":"'Daten Umschichtung'!G90","v":0},{"$f":"'Daten Umschichtung'!H90","v":0},{"$f":"'Daten Umschichtung'!I90","v":0},{"$f":"'Daten Umschichtung'!J90","v":0}]
[null,null,"Wertpapiererträge (brutto)","EUR ",0,{"$f":"'Daten Umschichtung'!F91","v":{"v":48500,"d":"48,500"}},{"$f":"'Daten Umschichtung'!G91","v":{"v":56648.75,"d":"56,649"}},{"$f":"'Daten Umschichtung'!H91","v":{"v":67425.43125,"d":"67,425"}},{"$f":"'Daten Umschichtung'!I91","v":{"v":68519.67403125,"d":"68,520"}},{"$f":"'Daten Umschichtung'!J91","v":{"v":69640.95962015627,"d":"69,641"}}]
[null,null,"Zinsen und ähnliche Erträge","EUR ",0,{"$f":"'Daten Umschichtung'!F96","v":0},{"$f":"'Daten Umschichtung'!G96","v":0},{"$f":"'Daten Umschichtung'!H96","v":0},{"$f":"'Daten Umschichtung'!I96","v":0},{"$f":"'Daten Umschichtung'!J96","v":0}]
[null,null,"Erträge aus sonstigem Vermögen","EUR ",0,{"$f":"'Daten Umschichtung'!F98","v":0},{"$f":"'Daten Umschichtung'!G98","v":0},{"$f":"'Daten Umschichtung'!H98","v":0},{"$f":"'Daten Umschichtung'!I98","v":0},{"$f":"'Daten Umschichtung'!J98","v":0}]
[null,null,"Ausgaben","EUR ",0,{"$f":"SUM(F40:F42)+SUM(F46:F50)","v":{"v":63500,"d":"63,500"}},{"$f":"SUM(G40:G42)+SUM(G46:G50)","v":{"v":64248.75,"d":"64,249"}},{"v":65013.93125000001,"d":"65,014"},{"v":65795.99653125,"d":"65,796"},{"v":66595.41190765626,"d":"66,595"}]
[null,null,"Ausgaben für den Stiftungszweck","EUR ",0,{"$f":"IF(Anlageziele!$M$5='Daten Einstellg_Ziele'!$D$21,Anlageziele!$M$7,IF(Anlageziele!$M$5='Daten Einstellg_Ziele'!$D$22,'Daten VE'!$D$51*Anlageziele!M7%,F31-F41-F42-F46-F47-F47-F48-F49-F50))","v":{"v":10000,"d":"10,000"}},{"$f":"IF(Anlageziele!$M$5='Daten Einstellg_Ziele'!$D$21,Anlageziele!$M$7,IF(Anlageziele!$M$5='Daten Einstellg_Ziele'!$D$22,'Daten VE'!$D$51*Anlageziele!N7%,G31-G41-G42-G46-G47-G47-G48-G49-G50))","v":{"v":10000,"d":"10,000"}},{"$f":"IF(Anlageziele!$M$5='Daten Einstellg_Ziele'!$D$21,Anlageziele!$M$7,IF(Anlageziele!$M$5='Daten Einstellg_Ziele'!$D$22,'Daten VE'!$D$51*Anlageziele!O7%,H31-H41-H42-H46-H47-H47-H48-H49-H50))","v":{"v":10000,"d":"10,000"}},{"$f":"IF(Anlageziele!$M$5='Daten Einstellg_Ziele'!$D$21,Anlageziele!$M$7,IF(Anlageziele!$M$5='Daten Einstellg_Ziele'!$D$22,'Daten VE'!$D$51*Anlageziele!P7%,I31-I41-I42-I46-I47-I47-I48-I49-I50))","v":{"v":10000,"d":"10,000"}},{"$f":"IF(Anlageziele!$M$5='Daten Einstellg_Ziele'!$D$21,Anlageziele!$M$7,IF(Anlageziele!$M$5='Daten Einstellg_Ziele'!$D$22,'Daten VE'!$D$51*Anlageziele!Q7%,J31-J41-J42-J46-J47-J47-J48-J49-J50))","v":{"v":10000,"d":"10,000"}}]
[null,null,"Allg. Verwaltungskosten","EUR ",0,{"$f":"'Einn._Ausg.'!C28","v":{"v":28000,"d":"28,000"}},{"$f":"'Einn._Ausg.'!D28","v":{"v":27030,"d":"27,030"}},{"$f":"'Einn._Ausg.'!E28","v":{"v":27570.600000000002,"d":"27,571"}},{"$f":"'Einn._Ausg.'!F28","v":{"v":28122.012,"d":"28,122"}},{"$f":"'Einn._Ausg.'!G28","v":{"v":28684.452240000002,"d":"28,684"}}]
[null,null,"Kosten Vermögensverwaltung","EUR ",0,{"$f":"'Daten Projektion'!I91","v":{"v":11220,"d":"11,220"}},{"$f":"'Daten Projektion'!J91","v":{"v":11444.4,"d":"11,444"}},{"$f":"'Daten Projektion'!K91","v":{"v":11673.288,"d":"11,673"}},{"$f":"'Daten Projektion'!L91","v":{"v":11906.75376,"d":"11,907"}},{"$f":"'Daten Projektion'!M91","v":{"v":12144.8888352,"d":"12,145"}}]
[null,null," davon Immobilien","EUR ",0,{"$f":"'Daten Projektion'!I80","v":{"v":5100,"d":"5,100"}},{"$f":"'Daten Projektion'!J80","v":{"v":5202,"d":"5,202"}},{"$f":"'Daten Projektion'!K80","v":{"v":5306.04,"d":"5,306"}},{"$f":"'Daten Projektion'!L80","v":{"v":5412.1608,"d":"5,412"}},{"$f":"'Daten Projektion'!M80","v":{"v":5520.4040159999995,"d":"5,520"}}]
[null,null," davon Beteiligungen","EUR ",0,{"$f":"'Daten Projektion'!I81","v":0},{"$f":"'Daten Projektion'!J81","v":0},{"$f":"'Daten Projektion'!K81","v":0},{"$f":"'Daten Projektion'!L81","v":0},{"$f":"'Daten Projektion'!M81","v":0}]
[null,null," davon Wertpapiere","EUR ",0,{"$f":"'Daten Projektion'!I82","v":{"v":6120,"d":"6,120"}},{"$f":"'Daten Projektion'!J82","v":{"v":6242.4,"d":"6,242"}},{"$f":"'Daten Projektion'!K82","v":{"v":6367.248,"d":"6,367"}},{"$f":"'Daten Projektion'!L82","v":{"v":6494.59296,"d":"6,495"}},{"$f":"'Daten Projektion'!M82","v":{"v":6624.4848192,"d":"6,624"}}]
[null,null,"Sollzinsen","EUR ",0,{"$f":"'Daten Umschichtung'!F99*-1","v":0},{"$f":"'Daten Umschichtung'!G99*-1","v":0},{"$f":"'Daten Umschichtung'!H99*-1","v":0},{"$f":"'Daten Umschichtung'!I99*-1","v":0},{"$f":"'Daten Umschichtung'!J99*-1","v":0}]
[null,null,"Tilgung",{"$f":"$D$31","v":"EUR "},0,{"$f":"(E17-F17)*-1","v":0},{"$f":"(F17-G17)*-1","v":0},{"$f":"(G17-H17)*-1","v":0},{"$f":"(H17-I17)*-1","v":0},{"$f":"(I17-J17)*-1","v":0}," "]
[null,null,"Sonstige Aufwände","EUR ",0,{"$f":"'Einn._Ausg.'!C27","v":{"v":3000,"d":"3,000"}},{"$f":"'Einn._Ausg.'!D27","v":{"v":3060,"d":"3,060"}},{"$f":"'Einn._Ausg.'!E27","v":{"v":3121.2,"d":"3,121"}},{"$f":"'Einn._Ausg.'!F27","v":{"v":3183.624,"d":"3,184"}},{"$f":"'Einn._Ausg.'!G27","v":{"v":3247.29648,"d":"3,247"}}]
[null,null,"Zuführung Freie Rücklage","EUR ",0,{"$f":"IF(Anlageziele!$M$5=\"Überschuss\",'Daten Projektion'!I106,'Daten Projektion'!I110)","v":{"v":11280,"d":"11,280"}},{"$f":"IF(Anlageziele!$M$5=\"Überschuss\",'Daten Projektion'!J106,'Daten Projektion'!J110)","v":{"v":12714.349999999999,"d":"12,714"}},{"$f":"IF(Anlageziele!$M$5=\"Überschuss\",'Daten Projektion'!K106,'Daten Projektion'!K110)","v":{"v":12648.843249999998,"d":"12,649"}},{"$f":"IF(Anlageziele!$M$5=\"Überschuss\",'Daten Projektion'!L106,'Daten Projektion'!L110)","v":{"v":12583.606771249993,"d":"12,584"}},{"$f":"IF(Anlageziele!$M$5=\"Überschuss\",'Daten Projektion'!M106,'Daten Projektion'!M110)","v":{"v":12518.774352456268,"d":"12,519"}}]
[null,null,"Neuanlage","EUR ",{"$f":"E33","v":0},{"$f":"F33","v":0},{"$f":"G33","v":0},0,0,0]
[null,null,"Kennzahlen",null," "]
[null,null,"Ausschüttungsrendite brutto","%",{"v":0,"d":"0.0%"},{"$f":"SUM(F34:F38)/E6","v":{"v":0.007697368421052632,"d":"0.8%"}},{"$f":"SUM(G34:G38)/F6","v":{"v":8.723331264089914E-3,"d":"0.9%"}},{"$f":"SUM(H34:H38)/G6","v":{"v":0.01006596652487585,"d":"1.0%"}},{"$f":"SUM(I34:I38)/H6","v":{"v":0.010121439555738507,"d":"1.0%"}},{"$f":"SUM(J34:J38)/I6","v":{"v":0.01017763250361979,"d":"1.0%"}}]
[null,null,"Verwaltungskostenquote 1 (Aufsicht)","%",{"v":0,"d":"0.0%"},{"$f":"(F41+F42)/(F31-F33)","v":{"v":0.6176377952755906,"d":"61.8%"}},{"$f":"(G41+G42)/(G31-G33)","v":{"v":0.5362379135525009,"d":"53.6%"}},{"v":0.474955621419266,"d":"47.5%"},{"v":0.4775409690421848,"d":"47.8%"},{"v":0.48007973484717054,"d":"48.0%"}]
[null,null,"Verwaltungskostenquote 2 (Finanzamt)","%",{"v":0,"d":"0.0%"},{"$f":"F41/(F31-F42-F33)","v":{"v":0.5355776587605203,"d":"53.6%"}},{"$f":"G41/(G31-G42-G33)","v":{"v":0.4482263717294026,"d":"44.8%"}},{"v":0.388574751408212,"d":"38.9%"},{"v":0.3910400921455146,"d":"39.1%"},{"v":0.3934653179695403,"d":"39.3%"}]
[null,null,"Zweckeffizienz der Erträge","%",{"v":0,"d":"0.0%"},{"$f":"F40/(F31-F33)","v":{"v":0.15748031496062992,"d":"15.7%"}},{"$f":"G40/(G31-G33)","v":{"v":0.13937525043990315,"d":"13.9%"}},{"v":0.12102664787425392,"d":"12.1%"},{"v":0.11929944877775439,"d":"11.9%"},{"v":0.11758204325731182,"d":"11.8%"}]
[null,null,"Zweckeffizienz des Vermögens","%",{"$f":"E40/E6","v":{"v":0,"d":"0.0%"}},{"v":1.3068905805861404E-3,"d":"0.1%"},{"v":1.2967189606408515E-3,"d":"0.1%"},{"v":1.2840769989164243E-3,"d":"0.1%"},{"v":1.2714570863618525E-3,"d":"0.1%"},{"v":0.001258859573866954,"d":"0.1%"}]
{"$rows_empty":46}
[null,null,"Ergebnisbeiträge"]
[{"$nulls":4},"Ant. Vermögen","Ant. Ertrag"]
[null,null,"Immobilien (Verkwert.)",null,{"$f":"#REF!/#REF!","v":{"$error":"#REF!"}},{"$f":"#REF!/#REF!","v":{"$error":"#REF!"}}]
[null,null,"Beteiligungen",null,{"$f":"#REF!/#REF!","v":{"$error":"#REF!"}},{"$f":"#REF!/#REF!","v":{"$error":"#REF!"}}]
[null,null,"Wertpapiere",null,{"$f":"#REF!/#REF!","v":{"$error":"#REF!"}},{"$f":"#REF!/#REF!","v":{"$error":"#REF!"}}]
[null,null,"Spar- und Termineinlagen",null,{"$f":"#REF!/#REF!","v":{"$error":"#REF!"}},{"$f":"#REF!/#REF!","v":{"$error":"#REF!"}}]
[null,null,"Sonstiges Vermögen",null,{"$f":"#REF!/#REF!","v":{"$error":"#REF!"}},{"$f":"#REF!/#REF!","v":{"$error":"#REF!"}}]
[{"$nulls":4},{"$f":"SUM(E105:E109)","v":{"$error":"#REF!"}},{"$f":"SUM(F105:F109)","v":{"$error":"#REF!"}}]

{"sheet":"Glossar","index":19,"n_rows":17,"n_cols":3,"rows_kept":17,"hidden":true}
["Glossar"]
[]
[null,"Begriff","Erklärung"]
[null,"DCF","Discounted Cashflow-Verfahren"]
[null,"Divesting"]
[null,"Engagement"]
[null,"Impact Investing"]
{"$rows_empty":9}
[null,"Vermögenserhaltungskonzept"]

{"sheet":"Eingabe Szenario","index":20,"n_rows":76,"n_cols":15,"rows_kept":76,"hidden":true}
[null,"Prämissen Szenario"]
[]
[null,"Beschreibung"]
[]
[]
[null,"Name der Stiftung:",{"$f":"Einstellungen!D5","v":"Paradigma-Stiftung"}]
[null,"Gründungsjahr (JJJJ)",{"$f":"Einstellungen!D6","v":2001}]
[null,"Auswertungsbeginn (JJJJ)",{"$f":"Einstellungen!D7","v":2019}]
[null,"Durchschnittliche Geldwertveränderung",{"v":0.015,"d":"1.5%"}]
[null,"Ausgaben für den Stiftungszweck",{"$nulls":3},1]
[null,"Zielausschüttung p.a. EUR",{"v":500000,"d":"500,000"}]
[null,"Aufgriffsgrenze Verwaltungskosten FA",{"v":0.25,"d":"25.0%"}]
[null,"Aufgriffsgrenze Verwaltungskosten Aufsicht",{"v":0.33,"d":"33.0%"}]
[null,"Darstellung Vermögen",{"$f":"IF(Einstellungen!R9=1,\"EUR\",\"TEUR\")","v":"TEUR"},"EUR",null,1]
[{"$nulls":3},"TEUR"]
[]
[null,null,"Grundfall","▼",{"$nulls":5},"Grundfall","▼"]
[null,"Immobilien EUR",{"$f":"Einstellungen!D17","v":0},0,{"$nulls":4},"Allgemeine Verwaltungskosten EUR",{"$f":"Einstellungen!K25","v":{"v":0.02,"d":"0"}},{"v":10000,"d":"10,000"}]
[null,"Beteiligungen EUR",{"$f":"Einstellungen!D18","v":0},0,{"$nulls":4},"Vermögensabh. allg. Verwaltungskosten",{"$f":"Einstellungen!K26","v":{"v":0.02,"d":"2.0%"}},{"v":0,"d":"0.0%"}]
[null,"Wertpapiere EUR",{"$f":"Einstellungen!D19","v":0},{"v":3000000,"d":"3,000,000"},{"$nulls":4},"Ertragsabh. allg. Verwaltungskosten",{"$f":"Einstellungen!K27","v":{"v":0.02,"d":"2.0%"}},{"v":0,"d":"0.0%"}]
[null,"Spar- und Termineinlagen EUR",{"$f":"Einstellungen!#REF!","v":{"$error":"#REF!"}},0,{"$nulls":4},"Fixkosten WP-Vermögen EUR",{"$f":"Einstellungen!K28","v":{"v":0.02,"d":"0"}},{"v":10000,"d":"10,000"}]
[null,"Sonstiges Vermögen EUR",{"$f":"Einstellungen!D21","v":0},0,{"$nulls":4},"Variable Gebühren auf Depotbestand",{"$f":"Einstellungen!K29","v":{"v":0,"d":"0.0%"}},{"v":0.008,"d":"0.8%"}]
[null,"Verbindlichkeiten EUR",{"$f":"Einstellungen!D22","v":0},0,{"$nulls":4},"Sonstige Aufwände EUR",{"$f":"Einstellungen!K32","v":"Ja"},0]
[null,"Gesamt EUR",{"$f":"SUM(C18:C22)-C23","v":{"$error":"#REF!"}},{"$f":"SUM(D18:D22)-D23","v":{"v":3000000,"d":"3,000,000"}}]
[]
[]
[]
[null,"Allokation",{"$nulls":7},"Grundfall","▼"]
[null,null,"Bestand","EUR","Neu",{"$nulls":3},"Anfangsbestand freie Rücklage EUR",{"$f":"Einstellungen!#REF!","v":{"$error":"#REF!"}},{"v":22000,"d":"22,000"}]
[null,"Aktien",{"v":0.2,"d":"20.0%"},{"$f":"$D$20*C30","v":{"v":600000,"d":"600,000"}},{"v":0.25,"d":"25.0%"},{"$nulls":3},"Zuführung freie Rücklage aus Erträgen p.a.",{"$f":"Einstellungen!#REF!","v":{"$error":"#REF!"}},{"v":0.33,"d":"33.0%"},{"$f":"IF(K30>33.3%,\"Maximal 33,3%\",\"\")","v":""}]
[null,"Renten",{"v":0.75,"d":"75.0%"},{"$f":"$D$20*C31","v":{"v":2250000,"d":"2,250,000"}},{"v":0.5,"d":"50.0%"},{"$nulls":3},"Zuführung freie Rücklage aus Spenden p.a.",{"$f":"Einstellungen!#REF!","v":{"$error":"#REF!"}},{"v":0.1,"d":"10.0%"},{"$f":"IF(K31>10%,\"Maximal 10%\",\"\")","v":""}]
[null,"Liquidität",{"v":0.05,"d":"5.0%"},{"$f":"$D$20*C32","v":{"v":150000,"d":"150,000"}},{"v":0.1,"d":"10.0%"},{"$nulls":3},"Bildung einer Umschichtungsrücklage?",{"$f":"Einstellungen!#REF!","v":{"$error":"#REF!"}},null,false,{"$f":"IF(L32=TRUE,1,0)","v":0}]
[null,"Alternative Anlagen",{"v":0,"d":"0.0%"},{"$f":"$D$20*C33","v":0},{"v":0.05,"d":"5.0%"},{"$nulls":3},"Anfangsbestand Umschichtungsrücklage",{"$f":"Einstellungen!K31","v":0},0]
[null,"Sonstige/gemischt",{"v":0,"d":"0.0%"},{"$f":"$D$20*C34","v":0},{"v":0.1,"d":"10.0%"},{"$nulls":3},"Liquiditätskonto unverzinst",{"$f":"Einstellungen!#REF!","v":{"$error":"#REF!"}},{"v":100000,"d":"100,000"}]
[null,"Gesamt",{"$f":"SUM(C30:C34)","v":{"v":1,"d":"100.0%"}},{"$f":"SUM(D30:D34)","v":{"v":3000000,"d":"3,000,000"}},{"$f":"SUM(E30:E34)","v":{"v":1,"d":"100.0%"}},null,{"$f":"IF(C35+E35<>200%,\"Gesamwert <> 100%\",\"\")","v":""}]
[]
[null,"Durchschnittsrenditen",{"$nulls":7},"Grundfall","▼"]
[null,null,"Kurs","Ausschüttg.","Gesamt",{"$nulls":3},"Spenden p.a. EUR",{"$f":"Einstellungen!K36","v":0},{"v":50000,"d":"50,000"}]
[null,"Aktien",{"v":0.04,"d":"4.0%"},{"v":0.03,"d":"3.0%"},{"$f":"C39+D39","v":{"v":0.07,"d":"7.0%"}},{"$nulls":3},"Zustiftung 1 EUR … im Jahr",{"$f":"Einstellungen!K37","v":0},{"v":500000,"d":"500,000"},null,3,{"$f":"2015+M39","v":2018},{"$f":"IF($F$14=1,K39,K39/1000)","v":{"v":500000,"d":"500,000"}}]
[null,"Renten",{"v":0,"d":"0.0%"},{"v":0.016,"d":"1.6%"},{"v":0.016,"d":"1.6%"},{"$nulls":3},"Zustiftung 2 EUR ... im Jahr",{"$f":"Einstellungen!K38","v":0},0,null,5,2020,0]
[null,"Liquidität",{"v":0,"d":"0.0%"},{"v":0.003,"d":"0.3%"},{"v":0.003,"d":"0.3%"},{"$nulls":3},"Zustiftung 3 EUR ... im Jahr",{"$f":"Einstellungen!K39","v":0},{"v":300000,"d":"300,000"},null,5,2020,{"v":300000,"d":"300,000"}]
[null,"Alternative Investments",{"v":0.02,"d":"2.0%"},{"v":0.02,"d":"2.0%"},{"v":0.04,"d":"4.0%"},{"$nulls":3},"Zuwendung in Rücklagen EUR … im Jahr",{"$f":"Einstellungen!K40","v":0},0,null,1,2016,0]
[null,"Sonstige/Gemischt",{"v":0.05,"d":"5.0%"},{"v":0,"d":"0.0%"},{"v":0.05,"d":"5.0%"},{"$nulls":3},"Zuwendung in Rücklagen EUR … im Jahr",{"$f":"Einstellungen!K41","v":0},0,null,1,2016,0]
[null,"Gesamtrendite gewichtet",{"$f":"$E$30*C39+$E$31*C40+$E$33*C42+$E$34*C43+$E$32*C41","v":{"v":0.016,"d":"1.6%"}},{"$f":"$E$30*D39+$E$31*D40+$E$33*D42+$E$34*D43+$E$32*D41","v":{"v":0.016800000000000002,"d":"1.7%"}},{"v":0.0328,"d":"3.3%"},{"$nulls":3},"Zuwendung in Rücklagen EUR … im Jahr",{"$f":"Einstellungen!K42","v":0},0,null,7,2022,0]
[]
[]
[null,null,"Grundfall","▼"]
[null,"Buchwert Grundstücke EUR",{"$f":"Einstellungen!D46","v":0},{"v":160000,"d":"160,000"},null,null,2016]
[null,"Buchwert Gebäude EUR",{"$f":"Einstellungen!D47","v":0},{"v":300000,"d":"300,000"},null,null,2017]
[null,"Mieteinnahmen p.a. EUR",{"$f":"Einstellungen!D48","v":0},{"v":12000,"d":"12,000"},null,null,2018]
[null,"Verwaltungskosten p.a. EUR",{"$f":"Einstellungen!D49","v":0},{"v":5000,"d":"5,000"},null,null,2019]
[null,"Wertveränderung p.a.",{"$f":"Einstellungen!D50","v":{"v":0,"d":"0.0%"}},{"v":0.01,"d":"1.0%"},null,null,2020]
[null,"Veränd. Mieten p.a.:",{"$f":"Einstellungen!D51","v":{"v":0,"d":"0.0%"}},{"v":0.01,"d":"1.0%"},null,null,2021]
[null,"Veränd. Verwaltgskosten p.a.",{"$f":"Einstellungen!D52","v":{"v":0,"d":"0.0%"}},{"v":0.01,"d":"1.0%"},null,null,2022]
[null,"Abschreibung p.a.:",{"$f":"Einstellungen!D53","v":{"v":0,"d":"0.0%"}},{"v":0.02,"d":"2.0%"},null,null,2023]
[{"$nulls":6},2024]
[{"$nulls":6},2025]
[null,null,"Grundfall","▼",null,null,2026]
[null,"Wertveränderung p.a.:",{"$f":"Einstellungen!D57","v":0},{"v":0,"d":"0.0%"},null,null,2027]
[null,"Ausschüttung p.a.:",{"$f":"Einstellungen!D58","v":{"v":0,"d":"0.0%"}},{"v":0.045,"d":"4.5%"},null,null,2028]
[null,"Kosten upfront EUR",{"$f":"Einstellungen!D59","v":0},{"v":5000,"d":"5,000"},null,null,2029]
[null,"Kosten upfront volumensabhängig",{"$f":"Einstellungen!D60","v":{"v":0,"d":"0.0%"}},{"v":0.03,"d":"3.0%"},null,null,2030]
[null,"Kosten laufend EUR",{"$f":"Einstellungen!D61","v":0},0]
[null,"Kosten laufend volumensabhängig",{"$f":"Einstellungen!D62","v":{"v":0,"d":"0.0%"}},{"v":0.01,"d":"1.0%"}]
[null,"Neuzeichnung EUR … im Jahr",{"$f":"Einstellungen!D63","v":0},{"v":10000,"d":"10,000"},null,9,{"$f":"2015+F65","v":2024}]
[]
[]
[null,null,"Grundfall","▼"]
[null,"Wertveränderung p.a.:",{"$f":"Einstellungen!D67","v":{"v":0,"d":"0.0%"}},{"v":0.01,"d":"1.0%"}]
[null,"Ausschüttung p.a.:",{"$f":"Einstellungen!D68","v":{"v":0,"d":"0.0%"}},{"v":0,"d":"0.0%"}]
[]
[]
[null,null,"Grundfall","▼"]
[null,"Zins p.a.",{"$f":"Einstellungen!#REF!","v":{"$error":"#REF!"}},{"v":0.02,"d":"2.0%"}]
[null,"Tilgungart"]
[null,"Tilgung EUR",{"$f":"Einstellungen!#REF!","v":{"$error":"#REF!"}},{"v":0.01,"d":"1.0%"}]

{"sheet":"Analyse Szenario","index":21,"n_rows":66,"n_cols":14,"rows_kept":66,"hidden":true}
["Szenario"]
[]
["Beschreibung",null,"Einh.","Bestand",{"$f":"'Eingabe Szenario'!C8","v":2019},{"$f":"E3+1","v":2020},2021,2022,2023,2024,2025,2026,2027,2028]
[]
["Vermögen",null,{"$f":"IF('Eingabe Szenario'!$F$14=1,'Eingabe Szenario'!$D$14,'Eingabe Szenario'!$D$15)","v":"EUR"},{"$f":"SUM(D6:D8)+SUM(D14:D17)","v":{"v":100000,"d":"100,000"}},{"$f":"SUM(E6:E8)+SUM(E14:E17)","v":{"$error":"#REF!"}},{"$error":"#REF!"},{"$error":"#REF!"},{"$error":"#REF!"},{"$error":"#REF!"},{"$error":"#REF!"},{"$error":"#REF!"},{"$error":"#REF!"},{"$error":"#REF!"},{"$error":"#REF!"}]
["Immobilien (Verkehrswert)",null,{"$f":"IF('Eingabe Szenario'!$F$14=1,'Eingabe Szenario'!$D$14,'Eingabe Szenario'!$D$15)","v":"EUR"},{"$f":"IF('Eingabe Szenario'!F14=1,'Eingabe Szenario'!D18,'Eingabe Szenario'!D18/1000)","v":0},{"$f":"D6+D6*'Eingabe Szenario'!$D$52","v":0},{"$f":"E6+E6*'Eingabe Szenario'!$D$52","v":0},{"$f":"F6+F6*'Eingabe Szenario'!$D$52","v":0},{"$f":"G6+G6*'Eingabe Szenario'!$D$52","v":0},{"$f":"H6+H6*'Eingabe Szenario'!$D$52","v":0},{"$f":"I6+I6*'Eingabe Szenario'!$D$52","v":0},{"$f":"J6+J6*'Eingabe Szenario'!$D$52","v":0},{"$f":"K6+K6*'Eingabe Szenario'!$D$52","v":0},{"$f":"L6+L6*'Eingabe Szenario'!$D$52","v":0},{"$f":"M6+M6*'Eingabe Szenario'!$D$52","v":0}]
["Beteiligungen",null,{"$f":"IF('Eingabe Szenario'!$F$14=1,'Eingabe Szenario'!$D$14,'Eingabe Szenario'!$D$15)","v":"EUR"},{"$f":"IF('Eingabe Szenario'!$F$14=1,'Eingabe Szenario'!D19,'Eingabe Szenario'!D19/1000)","v":0},{"$f":"D7+D7*'Eingabe Szenario'!$D$59","v":0},{"$f":"E7+E7*'Eingabe Szenario'!$D$59","v":0},{"$f":"F7+F7*'Eingabe Szenario'!$D$59","v":0},{"$f":"G7+G7*'Eingabe Szenario'!$D$59","v":0},{"$f":"H7+H7*'Eingabe Szenario'!$D$59","v":0},{"$f":"I7+I7*'Eingabe Szenario'!$D$59","v":0},{"$f":"J7+J7*'Eingabe Szenario'!$D$59","v":0},{"$f":"K7+K7*'Eingabe Szenario'!$D$59","v":0},{"$f":"L7+L7*'Eingabe Szenario'!$D$59","v":0},{"$f":"M7+M7*'Eingabe Szenario'!$D$59","v":0}]
["Wertpapiere",{"$f":"'Eingabe Szenario'!C44","v":{"v":0.016,"d":"1.6%"}},{"$f":"IF('Eingabe Szenario'!$F$14=1,'Eingabe Szenario'!$D$14,'Eingabe Szenario'!$D$15)","v":"EUR"},{"$f":"SUM(D9:D13)","v":0},{"$f":"SUM(E9:E13)","v":0},{"v":79010.00001484998,"d":"79,010"},{"v":385915.17361504835,"d":"385,915"},{"v":397798.9879146339,"d":"397,799"},{"v":411798.9871900984,"d":"411,799"},{"v":426324.0902316236,"d":"426,324"},{"v":441405.51311049215,"d":"441,406"},{"v":457066.6510344696,"d":"457,067"},{"v":473331.96940439683,"d":"473,332"},{"v":490227.00106713746,"d":"490,227"}]
[" davon Aktien",{"$f":"'Eingabe Szenario'!C39","v":{"v":0.04,"d":"4.0%"}},{"$f":"IF('Eingabe Szenario'!$F$14=1,'Eingabe Szenario'!$D$14,'Eingabe Szenario'!$D$15)","v":"EUR"},{"$f":"IF('Eingabe Szenario'!$F$14=1,'Eingabe Szenario'!F30,'Eingabe Szenario'!F30/1000)","v":0},{"$f":"D9+D9*'Eingabe Szenario'!$C$39+D59*'Eingabe Szenario'!$E$30+E60*'Eingabe Szenario'!$E$30","v":0},{"$f":"E9+E9*'Eingabe Szenario'!$C$39+E59*'Eingabe Szenario'!$E$30+'Analyse Szenario'!F60*'Eingabe Szenario'!$E$30","v":{"v":76002.5000037125,"d":"76,003"}},{"$f":"F9+F9*'Eingabe Szenario'!$C$39+F59*'Eingabe Szenario'!$E$30+'Analyse Szenario'!F60*'Eingabe Szenario'!$E$30","v":{"v":155002.8534038512,"d":"155,003"}},{"$f":"G9+G9*'Eingabe Szenario'!$C$39+G59*'Eingabe Szenario'!$E$30+'Analyse Szenario'!G60*'Eingabe Szenario'!$E$30","v":{"v":162161.84538543987,"d":"162,162"}},{"$f":"H9+H9*'Eingabe Szenario'!$C$39+H59*'Eingabe Szenario'!$E$30+'Analyse Szenario'!H60*'Eingabe Szenario'!$E$30","v":{"v":170038.1072277043,"d":"170,038"}},{"$f":"I9+I9*'Eingabe Szenario'!$C$39+I59*'Eingabe Szenario'!$E$30+'Analyse Szenario'!I60*'Eingabe Szenario'!$E$30","v":{"v":178251.54891180206,"d":"178,252"}},{"$f":"J9+J9*'Eingabe Szenario'!$C$39+J59*'Eingabe Szenario'!$E$30+'Analyse Szenario'!J60*'Eingabe Szenario'!$E$30","v":{"v":186818.52725929563,"d":"186,819"}},{"$f":"K9+K9*'Eingabe Szenario'!$C$39+K59*'Eingabe Szenario'!$E$30+'Analyse Szenario'!K60*'Eingabe Szenario'!$E$30","v":{"v":195753.84168470203,"d":"195,754"}},{"$f":"L9+L9*'Eingabe Szenario'!$C$39+L59*'Eingabe Szenario'!$E$30+'Analyse Szenario'!L60*'Eingabe Szenario'!$E$30","v":{"v":205072.91899783778,"d":"205,073"}},{"$f":"M9+M9*'Eingabe Szenario'!$C$39+M59*'Eingabe Szenario'!$E$30+'Analyse Szenario'!M60*'Eingabe Szenario'!$E$30","v":{"v":214791.8271911036,"d":"214,792"}}]
[" davon Renten",{"$f":"'Eingabe Szenario'!C40","v":{"v":0,"d":"0.0%"}},{"$f":"IF('Eingabe Szenario'!$F$14=1,'Eingabe Szenario'!$D$14,'Eingabe Szenario'!$D$15)","v":"EUR"},{"$f":"IF('Eingabe Szenario'!$F$14=1,'Eingabe Szenario'!$F$31,'Eingabe Szenario'!$F$31/1000)","v":0},{"$f":"D10+D10*'Eingabe Szenario'!$C$40+D60*'Eingabe Szenario'!$E$31+E61*'Eingabe Szenario'!$E$31","v":0},{"$f":"E10+E10*'Eingabe Szenario'!$C$40+E59*'Eingabe Szenario'!$E$31+E60*'Eingabe Szenario'!$E$31","v":{"v":2005.0000074250001,"d":"2,005"}},{"$f":"F10+F10*'Eingabe Szenario'!$C$40+F59*'Eingabe Szenario'!$E$31+F60*'Eingabe Szenario'!$E$31","v":{"v":153925.50680740539,"d":"153,926"}},{"$f":"G10+G10*'Eingabe Szenario'!$C$40+G59*'Eingabe Szenario'!$E$31+G60*'Eingabe Szenario'!$E$31","v":{"v":155843.26249827468,"d":"155,843"}},{"$f":"H10+H10*'Eingabe Szenario'!$C$40+H59*'Eingabe Szenario'!$E$31+H60*'Eingabe Szenario'!$E$31","v":{"v":158622.8385519684,"d":"158,623"}},{"$f":"I10+I10*'Eingabe Szenario'!$C$40+I59*'Eingabe Szenario'!$E$31+I60*'Eingabe Szenario'!$E$31","v":{"v":161446.67334194758,"d":"161,447"}},{"$f":"J10+J10*'Eingabe Szenario'!$C$40+J59*'Eingabe Szenario'!$E$31+J60*'Eingabe Szenario'!$E$31","v":{"v":164320.50612399052,"d":"164,321"}},{"$f":"K10+K10*'Eingabe Szenario'!$C$40+K59*'Eingabe Szenario'!$E$31+K60*'Eingabe Szenario'!$E$31","v":{"v":167245.65279405966,"d":"167,246"}},{"$f":"L10+L10*'Eingabe Szenario'!$C$40+L59*'Eingabe Szenario'!$E$31+L60*'Eingabe Szenario'!$E$31","v":{"v":170223.500085555,"d":"170,224"}},{"$f":"M10+M10*'Eingabe Szenario'!$C$40+M59*'Eingabe Szenario'!$E$31+M60*'Eingabe Szenario'!$E$31","v":{"v":173255.4829522596,"d":"173,255"}}]
[" davon Liquidität",{"$f":"'Eingabe Szenario'!C41","v":{"v":0,"d":"0.0%"}},{"$f":"IF('Eingabe Szenario'!$F$14=1,'Eingabe Szenario'!$D$14,'Eingabe Szenario'!$D$15)","v":"EUR"},{"$f":"IF('Eingabe Szenario'!$F$14=1,'Eingabe Szenario'!F32,'Eingabe Szenario'!F32/1000)","v":0},{"$f":"D11+D11*'Eingabe Szenario'!$C$41+D59*'Eingabe Szenario'!$E$32+'Analyse Szenario'!E60*'Eingabe Szenario'!$E$32","v":0},{"$f":"E11+E11*'Eingabe Szenario'!$C$41+E59*'Eingabe Szenario'!$E$32+'Analyse Szenario'!E60*'Eingabe Szenario'!$E$32","v":{"v":401.00000148500004,"d":"401"}},{"$f":"F11+F11*'Eingabe Szenario'!$C$41+F59*'Eingabe Szenario'!$E$32+'Analyse Szenario'!F60*'Eingabe Szenario'!$E$32","v":{"v":30785.10136148108,"d":"30,785"}},{"$f":"G11+G11*'Eingabe Szenario'!$C$41+G59*'Eingabe Szenario'!$E$32+'Analyse Szenario'!G60*'Eingabe Szenario'!$E$32","v":{"v":31168.65249965494,"d":"31,169"}},{"$f":"H11+H11*'Eingabe Szenario'!$C$41+H59*'Eingabe Szenario'!$E$32+'Analyse Szenario'!H60*'Eingabe Szenario'!$E$32","v":{"v":31724.567710393687,"d":"31,725"}},{"$f":"I11+I11*'Eingabe Szenario'!$C$41+I59*'Eingabe Szenario'!$E$32+'Analyse Szenario'!I60*'Eingabe Szenario'!$E$32","v":{"v":32289.33466838952,"d":"32,289"}},{"$f":"J11+J11*'Eingabe Szenario'!$C$41+J59*'Eingabe Szenario'!$E$32+'Analyse Szenario'!J60*'Eingabe Szenario'!$E$32","v":{"v":32864.10122479811,"d":"32,864"}},{"$f":"K11+K11*'Eingabe Szenario'!$C$41+K59*'Eingabe Szenario'!$E$32+'Analyse Szenario'!K60*'Eingabe Szenario'!$E$32","v":{"v":33449.13055881194,"d":"33,449"}},{"$f":"L11+L11*'Eingabe Szenario'!$C$41+L59*'Eingabe Szenario'!$E$32+'Analyse Szenario'!L60*'Eingabe Szenario'!$E$32","v":{"v":34044.70001711101,"d":"34,045"}},{"$f":"M11+M11*'Eingabe Szenario'!$C$41+M59*'Eingabe Szenario'!$E$32+'Analyse Szenario'!M60*'Eingabe Szenario'!$E$32","v":{"v":34651.09659045193,"d":"34,651"}}]
[" davon Alternative Investments",{"$f":"'Eingabe Szenario'!C42","v":{"v":0.02,"d":"2.0%"}},{"$f":"IF('Eingabe Szenario'!$F$14=1,'Eingabe Szenario'!$D$14,'Eingabe Szenario'!$D$15)","v":"EUR"},{"$f":"IF('Eingabe Szenario'!$F$14=1,'Eingabe Szenario'!F33,'Eingabe Szenario'!F33/1000)","v":0},{"$f":"D12+D12*'Eingabe Szenario'!$C$42+D59*'Eingabe Szenario'!$E$33+'Analyse Szenario'!E60*'Eingabe Szenario'!$E$33","v":0},{"$f":"E12+E12*'Eingabe Szenario'!$C$42+E59*'Eingabe Szenario'!$E$33+'Analyse Szenario'!E60*'Eingabe Szenario'!$E$33","v":{"v":200.50000074250002,"d":"201"}},{"$f":"F12+F12*'Eingabe Szenario'!$C$42+F59*'Eingabe Szenario'!$E$33+'Analyse Szenario'!F60*'Eingabe Szenario'!$E$33","v":{"v":15396.56068075539,"d":"15,397"}},{"$f":"G12+G12*'Eingabe Szenario'!$C$42+G59*'Eingabe Szenario'!$E$33+'Analyse Szenario'!G60*'Eingabe Szenario'!$E$33","v":{"v":15896.267463457429,"d":"15,896"}},{"$f":"H12+H12*'Eingabe Szenario'!$C$42+H59*'Eingabe Szenario'!$E$33+'Analyse Szenario'!H60*'Eingabe Szenario'!$E$33","v":{"v":16492.15041809595,"d":"16,492"}},{"$f":"I12+I12*'Eingabe Szenario'!$C$42+I59*'Eingabe Szenario'!$E$33+'Analyse Szenario'!I60*'Eingabe Szenario'!$E$33","v":{"v":17104.37690545579,"d":"17,104"}},{"$f":"J12+J12*'Eingabe Szenario'!$C$42+J59*'Eingabe Szenario'!$E$33+'Analyse Szenario'!J60*'Eingabe Szenario'!$E$33","v":{"v":17733.8477217692,"d":"17,734"}},{"$f":"K12+K12*'Eingabe Szenario'!$C$42+K59*'Eingabe Szenario'!$E$33+'Analyse Szenario'!K60*'Eingabe Szenario'!$E$33","v":{"v":18381.0393432115,"d":"18,381"}},{"$f":"L12+L12*'Eingabe Szenario'!$C$42+L59*'Eingabe Szenario'!$E$33+'Analyse Szenario'!L60*'Eingabe Szenario'!$E$33","v":{"v":19046.444859225267,"d":"19,046"}},{"$f":"M12+M12*'Eingabe Szenario'!$C$42+M59*'Eingabe Szenario'!$E$33+'Analyse Szenario'!M60*'Eingabe Szenario'!$E$33","v":{"v":19730.572043080232,"d":"19,731"}}]
[" davon Sonstige/gemischt",{"$f":"'Eingabe Szenario'!C43","v":{"v":0.05,"d":"5.0%"}},{"$f":"IF('Eingabe Szenario'!$F$14=1,'Eingabe Szenario'!$D$14,'Eingabe Szenario'!$D$15)","v":"EUR"},{"$f":"IF('Eingabe Szenario'!$F$14=1,'Eingabe Szenario'!F34,'Eingabe Szenario'!F34/1000)","v":0},{"$f":"D13+D13*'Eingabe Szenario'!$C$43+D59*'Eingabe Szenario'!$E$34+'Analyse Szenario'!E60*'Eingabe Szenario'!$E$34","v":0},{"$f":"E13+E13*'Eingabe Szenario'!$C$43+E59*'Eingabe Szenario'!$E$34+'Analyse Szenario'!E60*'Eingabe Szenario'!$E$34","v":{"v":401.00000148500004,"d":"401"}},{"$f":"F13+F13*'Eingabe Szenario'!$C$43+F59*'Eingabe Szenario'!$E$34+'Analyse Szenario'!F60*'Eingabe Szenario'!$E$34","v":{"v":30805.15136155533,"d":"30,805"}},{"$f":"G13+G13*'Eingabe Szenario'!$C$43+G59*'Eingabe Szenario'!$E$34+'Analyse Szenario'!G60*'Eingabe Szenario'!$E$34","v":{"v":32728.96006780696,"d":"32,729"}},{"$f":"H13+H13*'Eingabe Szenario'!$C$43+H59*'Eingabe Szenario'!$E$34+'Analyse Szenario'!H60*'Eingabe Szenario'!$E$34","v":{"v":34921.32328193605,"d":"34,921"}},{"$f":"I13+I13*'Eingabe Szenario'!$C$43+I59*'Eingabe Szenario'!$E$34+'Analyse Szenario'!I60*'Eingabe Szenario'!$E$34","v":{"v":37232.15640402869,"d":"37,232"}},{"$f":"J13+J13*'Eingabe Szenario'!$C$43+J59*'Eingabe Szenario'!$E$34+'Analyse Szenario'!J60*'Eingabe Szenario'!$E$34","v":{"v":39668.53078063871,"d":"39,669"}},{"$f":"K13+K13*'Eingabe Szenario'!$C$43+K59*'Eingabe Szenario'!$E$34+'Analyse Szenario'!K60*'Eingabe Szenario'!$E$34","v":{"v":42236.98665368448,"d":"42,237"}},{"$f":"L13+L13*'Eingabe Szenario'!$C$43+L59*'Eingabe Szenario'!$E$34+'Analyse Szenario'!L60*'Eingabe Szenario'!$E$34","v":{"v":44944.40544466777,"d":"44,944"}},{"$f":"M13+M13*'Eingabe Szenario'!$C$43+M59*'Eingabe Szenario'!$E$34+'Analyse Szenario'!M60*'Eingabe Szenario'!$E$34","v":{"v":47798.02229024208,"d":"47,798"}}]
["Spar- und Termineinlagen",{"$f":"'Eingabe Szenario'!C41","v":{"v":0,"d":"0.0%"}},{"$f":"IF('Eingabe Szenario'!$F$14=1,'Eingabe Szenario'!$D$14,'Eingabe Szenario'!$D$15)","v":"EUR"},{"$f":"IF('Eingabe Szenario'!$F$14=1,'Eingabe Szenario'!D21,'Eingabe Szenario'!D21/1000)","v":0},{"$f":"D14","v":0},{"$f":"E14","v":0},0,0,0,0,0,0,0,0]
["Sonstiges Vermögen",null,{"$f":"IF('Eingabe Szenario'!$F$14=1,'Eingabe Szenario'!$D$14,'Eingabe Szenario'!$D$15)","v":"EUR"},{"$f":"IF('Eingabe Szenario'!$F$14=1,'Eingabe Szenario'!D22,'Eingabe Szenario'!D22/1000)","v":0},{"$f":"D15+D15*'Eingabe Szenario'!$D$69","v":0},{"$f":"E15+E15*'Eingabe Szenario'!$D$69","v":0},{"$f":"F15+F15*'Eingabe Szenario'!$D$69","v":0},{"$f":"G15+G15*'Eingabe Szenario'!$D$69","v":0},{"$f":"H15+H15*'Eingabe Szenario'!$D$69","v":0},{"$f":"I15+I15*'Eingabe Szenario'!$D$69","v":0},{"$f":"J15+J15*'Eingabe Szenario'!$D$69","v":0},{"$f":"K15+K15*'Eingabe Szenario'!$D$69","v":0},{"$f":"L15+L15*'Eingabe Szenario'!$D$69","v":0},{"$f":"M15+M15*'Eingabe Szenario'!$D$69","v":0}]
["Verbindlichkeiten",null,{"$f":"IF('Eingabe Szenario'!$F$14=1,'Eingabe Szenario'!$D$14,'Eingabe Szenario'!$D$15)","v":"EUR"},{"$f":"IF('Eingabe Szenario'!$F$14=1,'Eingabe Szenario'!D23*-1,'Eingabe Szenario'!D23/1000*-1)","v":0},{"$f":"IF(E39<0,D16-D16*'Eingabe Szenario'!$D$76+E39,D16-D16*'Eingabe Szenario'!$D$76)","v":{"$error":"#REF!"}},{"$f":"IF(F39<0,E16-E16*'Eingabe Szenario'!$D$76+F39,E16-E16*'Eingabe Szenario'!$D$76)","v":{"$error":"#REF!"}},{"$f":"IF(G39<0,F16-F16*'Eingabe Szenario'!$D$76+G39,F16-F16*'Eingabe Szenario'!$D$76)","v":{"$error":"#REF!"}},{"$f":"IF(H39<0,G16-G16*'Eingabe Szenario'!$D$76+H39,G16-G16*'Eingabe Szenario'!$D$76)","v":{"$error":"#REF!"}},{"$f":"IF(I39<0,H16-H16*'Eingabe Szenario'!$D$76+I39,H16-H16*'Eingabe Szenario'!$D$76)","v":{"$error":"#REF!"}},{"$f":"IF(J39<0,I16-I16*'Eingabe Szenario'!$D$76+J39,I16-I16*'Eingabe Szenario'!$D$76)","v":{"$error":"#REF!"}},{"$f":"IF(K39<0,J16-J16*'Eingabe Szenario'!$D$76+K39,J16-J16*'Eingabe Szenario'!$D$76)","v":{"$error":"#REF!"}},{"$f":"IF(L39<0,K16-K16*'Eingabe Szenario'!$D$76+L39,K16-K16*'Eingabe Szenario'!$D$76)","v":{"$error":"#REF!"}},{"$f":"IF(M39<0,L16-L16*'Eingabe Szenario'!$D$76+M39,L16-L16*'Eingabe Szenario'!$D$76)","v":{"$error":"#REF!"}},{"$f":"IF(N39<0,M16-M16*'Eingabe Szenario'!$D$76+N39,M16-M16*'Eingabe Szenario'!$D$76)","v":{"$error":"#REF!"}}]
["Liquiditätskonto (unverzinst)",{"$f":"'Eingabe Szenario'!C41","v":{"v":0,"d":"0.0%"}},{"$f":"IF('Eingabe Szenario'!$F$14=1,'Eingabe Szenario'!$D$14,'Eingabe Szenario'!$D$15)","v":"EUR"},{"$f":"IF('Eingabe Szenario'!$F$14=1,'Eingabe Szenario'!K34,'Eingabe Szenario'!K34/1000)","v":{"v":100000,"d":"100,000"}},{"$f":"IF(E39>=0,D17+E39,D17)","v":{"$error":"#REF!"}},{"$error":"#REF!"},{"$error":"#REF!"},{"$error":"#REF!"},{"$error":"#REF!"},{"$error":"#REF!"},{"$error":"#REF!"},{"$error":"#REF!"},{"$error":"#REF!"},{"$error":"#REF!"}]
["Rechnungslegung"]
["Buchwert Grundstücke",null,{"$f":"IF('Eingabe Szenario'!$F$14=1,'Eingabe Szenario'!$D$14,'Eingabe Szenario'!$D$15)","v":"EUR"},{"$f":"IF('Eingabe Szenario'!$F$14=1,'Eingabe Szenario'!D48,'Eingabe Szenario'!D48/1000)","v":{"v":160000,"d":"160,000"}},{"$f":"D19","v":{"v":160000,"d":"160,000"}},{"$f":"E19","v":{"v":160000,"d":"160,000"}},{"v":160000,"d":"160,000"},{"v":160000,"d":"160,000"},{"v":160000,"d":"160,000"},{"v":160000,"d":"160,000"},{"v":160000,"d":"160,000"},{"v":160000,"d":"160,000"},{"v":160000,"d":"160,000"},{"v":160000,"d":"160,000"}]
["Buchwert Gebäude",null,{"$f":"IF('Eingabe Szenario'!$F$14=1,'Eingabe Szenario'!$D$14,'Eingabe Szenario'!$D$15)","v":"EUR"},{"$f":"IF('Eingabe Szenario'!$F$14=1,'Eingabe Szenario'!D49,'Eingabe Szenario'!D49/1000)","v":{"v":300000,"d":"300,000"}},{"$f":"D20-D21","v":{"v":294000,"d":"294,000"}},{"$f":"E20-E21","v":{"v":288120,"d":"288,120"}},{"v":282357.6,"d":"282,358"},{"v":276710.448,"d":"276,710"},{"v":271176.23903999996,"d":"271,176"},{"v":265752.7142592,"d":"265,753"},{"v":260437.659974016,"d":"260,438"},{"v":255228.90677453566,"d":"255,229"},{"v":250124.32863904495,"d":"250,124"},{"v":245121.84206626404,"d":"245,122"}]
["AfA Immobilien",{"$f":"'Eingabe Szenario'!D55","v":{"v":0.02,"d":"2.0%"}},{"$f":"IF('Eingabe Szenario'!$F$14=1,'Eingabe Szenario'!$D$14,'Eingabe Szenario'!$D$15)","v":"EUR"},{"$f":"D20*'Eingabe Szenario'!D55","v":{"v":6000,"d":"6,000"}},{"$f":"E20*'Eingabe Szenario'!$D$55","v":{"v":5880,"d":"5,880"}},{"$f":"F20*'Eingabe Szenario'!$D$55","v":{"v":5762.400000000001,"d":"5,762"}},{"$f":"G20*'Eingabe Szenario'!$D$55","v":{"v":5647.152,"d":"5,647"}},{"$f":"H20*'Eingabe Szenario'!$D$55","v":{"v":5534.20896,"d":"5,534"}},{"$f":"I20*'Eingabe Szenario'!$D$55","v":{"v":5423.5247807999995,"d":"5,424"}},{"$f":"J20*'Eingabe Szenario'!$D$55","v":{"v":5315.054285183999,"d":"5,315"}},{"$f":"K20*'Eingabe Szenario'!$D$55","v":{"v":5208.75319948032,"d":"5,209"}},{"$f":"L20*'Eingabe Szenario'!$D$55","v":{"v":5104.578135490713,"d":"5,105"}},{"$f":"M20*'Eingabe Szenario'!$D$55","v":{"v":5002.486572780899,"d":"5,002"}},{"$f":"N20*'Eingabe Szenario'!$D$55","v":{"v":4902.4368413252805,"d":"4,902"}}]
["Stille Reserven Immobilien",null,{"$f":"IF('Eingabe Szenario'!$F$14=1,'Eingabe Szenario'!$D$14,'Eingabe Szenario'!$D$15)","v":"EUR"},{"$f":"D6-D19-D20","v":{"v":-460000,"d":"-460,000 "}},{"v":-454000,"d":"-454,000 "},{"v":-448120,"d":"-448,120 "},{"v":-442357.6,"d":"-442,358 "},{"v":-436710.448,"d":"-436,710 "},{"v":-431176.23903999996,"d":"-431,176 "},{"v":-425752.7142592,"d":"-425,753 "},{"v":-420437.659974016,"d":"-420,438 "},{"v":-415228.90677453566,"d":"-415,229 "},{"v":-410124.32863904495,"d":"-410,124 "},{"v":-405121.842066264,"d":"-405,122 "}]
["Aktienquote Wertpapiere",null,"%",{"$f":"D9/D8","v":{"$error":"#DIV/0!"}},{"$f":"E9/E8","v":{"$error":"#DIV/0!"}},{"v":0.9619351979423842,"d":"96.2%"},{"v":0.40165006198607534,"d":"40.2%"},{"v":0.40764770728938904,"d":"40.8%"},{"v":0.41291531188057484,"d":"41.3%"},{"v":0.4181127761627481,"d":"41.8%"},{"v":0.42323560016916106,"d":"42.3%"},{"v":0.4282829238179079,"d":"42.8%"},{"v":0.433253894208509,"d":"43.3%"},{"v":0.43814768815985206,"d":"43.8%"}]
["Aktienquote Gesamtverm.",null,"%",{"$f":"D9/D5","v":{"v":0,"d":"0.0%"}},{"$error":"#REF!"},{"$error":"#REF!"},{"$error":"#REF!"},{"$error":"#REF!"},{"$error":"#REF!"},{"$error":"#REF!"},{"$error":"#REF!"},{"$error":"#REF!"},{"$error":"#REF!"},{"$error":"#REF!"}]
["Bestand freie Rücklage",null,{"$f":"IF('Eingabe Szenario'!$F$14=1,'Eingabe Szenario'!$D$14,'Eingabe Szenario'!$D$15)","v":"EUR"},{"$f":"IF('Eingabe Szenario'!$F$14=1,'Eingabe Szenario'!K29,'Eingabe Szenario'!K29/1000)","v":{"v":22000,"d":"22,000"}},{"$f":"D25+D27","v":{"v":22000,"d":"22,000"}},{"$f":"E25+E27","v":{"$error":"#REF!"}},{"$error":"#REF!"},{"$error":"#REF!"},{"$error":"#REF!"},{"$error":"#REF!"},{"$error":"#REF!"},{"$error":"#REF!"},{"$error":"#REF!"},{"$error":"#REF!"}]
["Tilgung",{"$f":"'Eingabe Szenario'!D76","v":{"v":0.01,"d":"1.0%"}},{"$f":"IF('Eingabe Szenario'!$F$14=1,'Eingabe Szenario'!$D$14,'Eingabe Szenario'!$D$15)","v":"EUR"},0,{"$f":"IF('Eingabe Szenario'!$F$14=1,'Eingabe Szenario'!#REF!*'Eingabe Szenario'!$D$76*-1,('Eingabe Szenario'!#REF!*'Eingabe Szenario'!$D$76*-1)/1000)","v":{"$error":"#REF!"}},{"$f":"IF('Eingabe Szenario'!$F$14=1,'Eingabe Szenario'!#REF!*'Eingabe Szenario'!$D$76*-1,('Eingabe Szenario'!#REF!*'Eingabe Szenario'!$D$76*-1)/1000)","v":{"$error":"#REF!"}},{"$f":"IF('Eingabe Szenario'!$F$14=1,'Eingabe Szenario'!#REF!*'Eingabe Szenario'!$D$76*-1,('Eingabe Szenario'!#REF!*'Eingabe Szenario'!$D$76*-1)/1000)","v":{"$error":"#REF!"}},{"$f":"IF('Eingabe Szenario'!$F$14=1,'Eingabe Szenario'!#REF!*'Eingabe Szenario'!$D$76*-1,('Eingabe Szenario'!#REF!*'Eingabe Szenario'!$D$76*-1)/1000)","v":{"$error":"#REF!"}},{"$f":"IF('Eingabe Szenario'!$F$14=1,'Eingabe Szenario'!#REF!*'Eingabe Szenario'!$D$76*-1,('Eingabe Szenario'!#REF!*'Eingabe Szenario'!$D$76*-1)/1000)","v":{"$error":"#REF!"}},{"$f":"IF('Eingabe Szenario'!$F$14=1,'Eingabe Szenario'!#REF!*'Eingabe Szenario'!$D$76*-1,('Eingabe Szenario'!#REF!*'Eingabe Szenario'!$D$76*-1)/1000)","v":{"$error":"#REF!"}},{"$f":"IF('Eingabe Szenario'!$F$14=1,'Eingabe Szenario'!#REF!*'Eingabe Szenario'!$D$76*-1,('Eingabe Szenario'!#REF!*'Eingabe Szenario'!$D$76*-1)/1000)","v":{"$error":"#REF!"}},{"$f":"IF('Eingabe Szenario'!$F$14=1,'Eingabe Szenario'!#REF!*'Eingabe Szenario'!$D$76*-1,('Eingabe Szenario'!#REF!*'Eingabe Szenario'!$D$76*-1)/1000)","v":{"$error":"#REF!"}},{"$f":"IF('Eingabe Szenario'!$F$14=1,'Eingabe Szenario'!#REF!*'Eingabe Szenario'!$D$76*-1,('Eingabe Szenario'!#REF!*'Eingabe Szenario'!$D$76*-1)/1000)","v":{"$error":"#REF!"}},{"$f":"IF('Eingabe Szenario'!$F$14=1,'Eingabe Szenario'!#REF!*'Eingabe Szenario'!$D$76*-1,('Eingabe Szenario'!#REF!*'Eingabe Szenario'!$D$76*-1)/1000)","v":{"$error":"#REF!"}}]
["Veränderung freie Rücklage inkl. Tilgung",null,{"$f":"IF('Eingabe Szenario'!$F$14=1,'Eingabe Szenario'!$D$14,'Eingabe Szenario'!$D$15)","v":"EUR"},{"$f":"D59","v":0},{"$f":"E59+E26","v":{"$error":"#REF!"}},{"$error":"#REF!"},{"$error":"#REF!"},{"$error":"#REF!"},{"$error":"#REF!"},{"$error":"#REF!"},{"$error":"#REF!"},{"$error":"#REF!"},{"$error":"#REF!"},{"$error":"#REF!"}]
["Bestand Umschichtungsrücklage",null,{"$f":"IF('Eingabe Szenario'!$F$14=1,'Eingabe Szenario'!$D$14,'Eingabe Szenario'!$D$15)","v":"EUR"},{"$f":"IF('Eingabe Szenario'!$F$14=1,'Eingabe Szenario'!K33,'Eingabe Szenario'!K33/1000)","v":0},{"$f":"D28+D29","v":0},{"$f":"E28+E29","v":0},0,0,0,0,0,0,0,0]
["Veränderung Umschichtungsrücklage",null,{"$f":"IF('Eingabe Szenario'!$F$14=1,'Eingabe Szenario'!$D$14,'Eingabe Szenario'!$D$15)","v":"EUR"},0,{"$f":"IF('Eingabe Szenario'!$L$32=TRUE,(D9*'Eingabe Szenario'!$C$39+'Analyse Szenario'!D10*'Eingabe Szenario'!$C$40+'Analyse Szenario'!D11*'Eingabe Szenario'!$C$41+'Analyse Szenario'!D12*'Eingabe Szenario'!$C$42+'Analyse Szenario'!D13*'Eingabe Szenario'!$C$43)-D8*'Eingabe Szenario'!$C$9+IF(E3='Eingabe Szenario'!$N$42,'Eingabe Szenario'!$O$42,0)+IF(E3='Eingabe Szenario'!$N$43,'Eingabe Szenario'!$O$43,0)+IF(E3='Eingabe Szenario'!$N$44,'Eingabe Szenario'!$O$44,0),0)","v":0},{"$f":"IF('Eingabe Szenario'!$L$32=TRUE,(E9*'Eingabe Szenario'!$C$39+'Analyse Szenario'!E10*'Eingabe Szenario'!$C$40+'Analyse Szenario'!E11*'Eingabe Szenario'!$C$41+'Analyse Szenario'!E12*'Eingabe Szenario'!$C$42+'Analyse Szenario'!E13*'Eingabe Szenario'!$C$43)-E8*'Eingabe Szenario'!$C$9+IF(F3='Eingabe Szenario'!$N$42,'Eingabe Szenario'!$O$42,0)+IF(F3='Eingabe Szenario'!$N$43,'Eingabe Szenario'!$O$43,0)+IF(F3='Eingabe Szenario'!$N$44,'Eingabe Szenario'!$O$44,0),0)","v":0},{"$f":"IF('Eingabe Szenario'!$L$32=TRUE,(F9*'Eingabe Szenario'!$C$39+'Analyse Szenario'!F10*'Eingabe Szenario'!$C$40+'Analyse Szenario'!F11*'Eingabe Szenario'!$C$41+'Analyse Szenario'!F12*'Eingabe Szenario'!$C$42+'Analyse Szenario'!F13*'Eingabe Szenario'!$C$43)-F8*'Eingabe Szenario'!$C$9+IF(G3='Eingabe Szenario'!$N$42,'Eingabe Szenario'!$O$42,0)+IF(G3='Eingabe Szenario'!$N$43,'Eingabe Szenario'!$O$43,0)+IF(G3='Eingabe Szenario'!$N$44,'Eingabe Szenario'!$O$44,0),0)","v":0},{"$f":"IF('Eingabe Szenario'!$L$32=TRUE,(G9*'Eingabe Szenario'!$C$39+'Analyse Szenario'!G10*'Eingabe Szenario'!$C$40+'Analyse Szenario'!G11*'Eingabe Szenario'!$C$41+'Analyse Szenario'!G12*'Eingabe Szenario'!$C$42+'Analyse Szenario'!G13*'Eingabe Szenario'!$C$43)-G8*'Eingabe Szenario'!$C$9+IF(H3='Eingabe Szenario'!$N$42,'Eingabe Szenario'!$O$42,0)+IF(H3='Eingabe Szenario'!$N$43,'Eingabe Szenario'!$O$43,0)+IF(H3='Eingabe Szenario'!$N$44,'Eingabe Szenario'!$O$44,0),0)","v":0},{"$f":"IF('Eingabe Szenario'!$L$32=TRUE,(H9*'Eingabe Szenario'!$C$39+'Analyse Szenario'!H10*'Eingabe Szenario'!$C$40+'Analyse Szenario'!H11*'Eingabe Szenario'!$C$41+'Analyse Szenario'!H12*'Eingabe Szenario'!$C$42+'Analyse Szenario'!H13*'Eingabe Szenario'!$C$43)-H8*'Eingabe Szenario'!$C$9+IF(I3='Eingabe Szenario'!$N$42,'Eingabe Szenario'!$O$42,0)+IF(I3='Eingabe Szenario'!$N$43,'Eingabe Szenario'!$O$43,0)+IF(I3='Eingabe Szenario'!$N$44,'Eingabe Szenario'!$O$44,0),0)","v":0},{"$f":"IF('Eingabe Szenario'!$L$32=TRUE,(I9*'Eingabe Szenario'!$C$39+'Analyse Szenario'!I10*'Eingabe Szenario'!$C$40+'Analyse Szenario'!I11*'Eingabe Szenario'!$C$41+'Analyse Szenario'!I12*'Eingabe Szenario'!$C$42+'Analyse Szenario'!I13*'Eingabe Szenario'!$C$43)-I8*'Eingabe Szenario'!$C$9+IF(J3='Eingabe Szenario'!$N$42,'Eingabe Szenario'!$O$42,0)+IF(J3='Eingabe Szenario'!$N$43,'Eingabe Szenario'!$O$43,0)+IF(J3='Eingabe Szenario'!$N$44,'Eingabe Szenario'!$O$44,0),0)","v":0},{"$f":"IF('Eingabe Szenario'!$L$32=TRUE,(J9*'Eingabe Szenario'!$C$39+'Analyse Szenario'!J10*'Eingabe Szenario'!$C$40+'Analyse Szenario'!J11*'Eingabe Szenario'!$C$41+'Analyse Szenario'!J12*'Eingabe Szenario'!$C$42+'Analyse Szenario'!J13*'Eingabe Szenario'!$C$43)-J8*'Eingabe Szenario'!$C$9+IF(K3='Eingabe Szenario'!$N$42,'Eingabe Szenario'!$O$42,0)+IF(K3='Eingabe Szenario'!$N$43,'Eingabe Szenario'!$O$43,0)+IF(K3='Eingabe Szenario'!$N$44,'Eingabe Szenario'!$O$44,0),0)","v":0},{"$f":"IF('Eingabe Szenario'!$L$32=TRUE,(K9*'Eingabe Szenario'!$C$39+'Analyse Szenario'!K10*'Eingabe Szenario'!$C$40+'Analyse Szenario'!K11*'Eingabe Szenario'!$C$41+'Analyse Szenario'!K12*'Eingabe Szenario'!$C$42+'Analyse Szenario'!K13*'Eingabe Szenario'!$C$43)-K8*'Eingabe Szenario'!$C$9+IF(L3='Eingabe Szenario'!$N$42,'Eingabe Szenario'!$O$42,0)+IF(L3='Eingabe Szenario'!$N$43,'Eingabe Szenario'!$O$43,0)+IF(L3='Eingabe Szenario'!$N$44,'Eingabe Szenario'!$O$44,0),0)","v":0},{"$f":"IF('Eingabe Szenario'!$L$32=TRUE,(L9*'Eingabe Szenario'!$C$39+'Analyse Szenario'!L10*'Eingabe Szenario'!$C$40+'Analyse Szenario'!L11*'Eingabe Szenario'!$C$41+'Analyse Szenario'!L12*'Eingabe Szenario'!$C$42+'Analyse Szenario'!L13*'Eingabe Szenario'!$C$43)-L8*'Eingabe Szenario'!$C$9+IF(M3='Eingabe Szenario'!$N$42,'Eingabe Szenario'!$O$42,0)+IF(M3='Eingabe Szenario'!$N$43,'Eingabe Szenario'!$O$43,0)+IF(M3='Eingabe Szenario'!$N$44,'Eingabe Szenario'!$O$44,0),0)","v":0},{"$f":"IF('Eingabe Szenario'!$L$32=TRUE,(M9*'Eingabe Szenario'!$C$39+'Analyse Szenario'!M10*'Eingabe Szenario'!$C$40+'Analyse Szenario'!M11*'Eingabe Szenario'!$C$41+'Analyse Szenario'!M12*'Eingabe Szenario'!$C$42+'Analyse Szenario'!M13*'Eingabe Szenario'!$C$43)-M8*'Eingabe Szenario'!$C$9+IF(N3='Eingabe Szenario'!$N$42,'Eingabe Szenario'!$O$42,0)+IF(N3='Eingabe Szenario'!$N$43,'Eingabe Szenario'!$O$43,0)+IF(N3='Eingabe Szenario'!$N$44,'Eingabe Szenario'!$O$44,0),0)","v":0}]
["Realer Kapitalerhalt Grundstock (Ist)",null,{"$f":"IF('Eingabe Szenario'!$F$14=1,'Eingabe Szenario'!$D$14,'Eingabe Szenario'!$D$15)","v":"EUR"},{"$f":"D5-D17-D22-D25-D28","v":{"v":438000,"d":"438,000"}},{"$f":"E5-E17-E22-E25-E28","v":{"$error":"#REF!"}},{"$error":"#REF!"},{"$error":"#REF!"},{"$error":"#REF!"},{"$error":"#REF!"},{"$error":"#REF!"},{"$error":"#REF!"},{"$error":"#REF!"},{"$error":"#REF!"},{"$error":"#REF!"}]
["Realer Kapitalerhalt Grundstock (Soll)",null,{"$f":"IF('Eingabe Szenario'!$F$14=1,'Eingabe Szenario'!$D$14,'Eingabe Szenario'!$D$15)","v":"EUR"},{"$f":"IF('Eingabe Szenario'!$F$14=1,'Eingabe Szenario'!D24,'Eingabe Szenario'!D24/1000)","v":{"v":3000000,"d":"3,000,000"}},{"$f":"D31+D43+(D43+D31)*'Eingabe Szenario'!$C$9","v":{"v":3045000,"d":"3,045,000"}},{"$f":"E31+E43+(E43+E31)*'Eingabe Szenario'!$C$9","v":{"v":3090675,"d":"3,090,675"}},{"$f":"F31+F43+(F43+F31)*'Eingabe Szenario'!$C$9","v":{"v":3441535.125,"d":"3,441,535"}},{"$f":"G31+G43+(G43+G31)*'Eingabe Szenario'!$C$9","v":{"v":3493158.151875,"d":"3,493,158"}},{"$f":"H31+H43+(H43+H31)*'Eingabe Szenario'!$C$9","v":{"v":3545555.524153125,"d":"3,545,556"}},{"$f":"I31+I43+(I43+I31)*'Eingabe Szenario'!$C$9","v":{"v":3598738.857015422,"d":"3,598,739"}},{"$f":"J31+J43+(J43+J31)*'Eingabe Szenario'!$C$9","v":{"v":3652719.939870653,"d":"3,652,720"}},{"$f":"K31+K43+(K43+K31)*'Eingabe Szenario'!$C$9","v":{"v":3707510.738968713,"d":"3,707,511"}},{"$f":"L31+L43+(L43+L31)*'Eingabe Szenario'!$C$9","v":{"v":3763123.400053244,"d":"3,763,123"}},{"$f":"M31+M43+(M43+M31)*'Eingabe Szenario'!$C$9","v":{"v":3819570.251054043,"d":"3,819,570"}}]
["Delta absolut",null,{"$f":"IF('Eingabe Szenario'!$F$14=1,'Eingabe Szenario'!$D$14,'Eingabe Szenario'!$D$15)","v":"EUR"},{"$f":"D30+D28+D25+D22-D31","v":{"v":-3000000,"d":"-3,000,000 "}},{"$f":"E30+E28+E25+E22-E31","v":{"$error":"#REF!"}},{"$error":"#REF!"},{"$error":"#REF!"},{"$error":"#REF!"},{"$error":"#REF!"},{"$error":"#REF!"},{"$error":"#REF!"},{"$error":"#REF!"},{"$error":"#REF!"},{"$error":"#REF!"}]
["Delta Prozent",null,"%",{"$f":"D32/D31","v":{"v":-1,"d":"-100.0%"}},{"$f":"E32/E31","v":{"$error":"#REF!"}},{"$f":"F32/F31","v":{"$error":"#REF!"}},{"$error":"#REF!"},{"$error":"#REF!"},{"$error":"#REF!"},{"$error":"#REF!"},{"$error":"#REF!"},{"$error":"#REF!"},{"$error":"#REF!"},{"$error":"#REF!"}]
[]
[]
[]
["Beschreibung",null,"Einh.","Bestand",{"$f":"'Eingabe Szenario'!C8","v":2019},{"$f":"E37+1","v":2020},2021,2022,2023,2024,2025,2026,2027,2028]
[]
["Saldo Liquidität",null,{"$f":"IF('Eingabe Szenario'!$F$14=1,'Eingabe Szenario'!$D$14,'Eingabe Szenario'!$D$15)","v":"EUR"},{"$f":"D41-D49","v":0},{"$f":"E41-E49","v":{"$error":"#REF!"}},{"$f":"F41-F49","v":{"$error":"#REF!"}},{"$error":"#REF!"},{"$error":"#REF!"},{"$error":"#REF!"},{"$error":"#REF!"},{"$error":"#REF!"},{"$error":"#REF!"},{"$error":"#REF!"},{"$error":"#REF!"}]
[]
["Einnahmen",null,{"$f":"IF('Eingabe Szenario'!$F$14=1,'Eingabe Szenario'!$D$14,'Eingabe Szenario'!$D$15)","v":"EUR"},{"$f":"SUM(D42:D47)","v":0},{"v":62000.000045,"d":"62,000"},{"v":362120,"d":"362,120"},{"v":64558.56800024948,"d":"64,559"},{"v":69876.79222873357,"d":"69,877"},{"v":70257.02698830371,"d":"70,257"},{"v":70676.24594635573,"d":"70,676"},{"v":71107.89059015151,"d":"71,108"},{"v":71552.57739915661,"d":"71,553"},{"v":72010.79434132365,"d":"72,011"},{"v":72483.04984075218,"d":"72,483"}]
["Spenden",null,{"$f":"IF('Eingabe Szenario'!$F$14=1,'Eingabe Szenario'!$D$14,'Eingabe Szenario'!$D$15)","v":"EUR"},0,{"$f":"IF('Eingabe Szenario'!$F$14=1,'Eingabe Szenario'!$K$38,'Eingabe Szenario'!$K$38/1000)","v":{"v":50000,"d":"50,000"}},{"$f":"IF('Eingabe Szenario'!$F$14=1,'Eingabe Szenario'!$K$38,'Eingabe Szenario'!$K$38/1000)","v":{"v":50000,"d":"50,000"}},{"$f":"IF('Eingabe Szenario'!$F$14=1,'Eingabe Szenario'!$K$38,'Eingabe Szenario'!$K$38/1000)","v":{"v":50000,"d":"50,000"}},{"$f":"IF('Eingabe Szenario'!$F$14=1,'Eingabe Szenario'!$K$38,'Eingabe Szenario'!$K$38/1000)","v":{"v":50000,"d":"50,000"}},{"$f":"IF('Eingabe Szenario'!$F$14=1,'Eingabe Szenario'!$K$38,'Eingabe Szenario'!$K$38/1000)","v":{"v":50000,"d":"50,000"}},{"$f":"IF('Eingabe Szenario'!$F$14=1,'Eingabe Szenario'!$K$38,'Eingabe Szenario'!$K$38/1000)","v":{"v":50000,"d":"50,000"}},{"$f":"IF('Eingabe Szenario'!$F$14=1,'Eingabe Szenario'!$K$38,'Eingabe Szenario'!$K$38/1000)","v":{"v":50000,"d":"50,000"}},{"$f":"IF('Eingabe Szenario'!$F$14=1,'Eingabe Szenario'!$K$38,'Eingabe Szenario'!$K$38/1000)","v":{"v":50000,"d":"50,000"}},{"$f":"IF('Eingabe Szenario'!$F$14=1,'Eingabe Szenario'!$K$38,'Eingabe Szenario'!$K$38/1000)","v":{"v":50000,"d":"50,000"}},{"$f":"IF('Eingabe Szenario'!$F$14=1,'Eingabe Szenario'!$K$38,'Eingabe Szenario'!$K$38/1000)","v":{"v":50000,"d":"50,000"}}]
["Zustiftungen",null,{"$f":"IF('Eingabe Szenario'!$F$14=1,'Eingabe Szenario'!$D$14,'Eingabe Szenario'!$D$15)","v":"EUR"},0,{"$f":"IF('Analyse Szenario'!E3='Eingabe Szenario'!$N$39,'Eingabe Szenario'!$O$39,0)+IF('Analyse Szenario'!E3='Eingabe Szenario'!$N$40,'Eingabe Szenario'!$O$40,0)+IF('Analyse Szenario'!E3='Eingabe Szenario'!$N$41,'Eingabe Szenario'!$O$41,0)","v":0},{"$f":"IF('Analyse Szenario'!F3='Eingabe Szenario'!$N$39,'Eingabe Szenario'!$O$39,0)+IF('Analyse Szenario'!F3='Eingabe Szenario'!$N$40,'Eingabe Szenario'!$O$40,0)+IF('Analyse Szenario'!F3='Eingabe Szenario'!$N$41,'Eingabe Szenario'!$O$41,0)","v":{"v":300000,"d":"300,000"}},{"$f":"IF('Analyse Szenario'!G3='Eingabe Szenario'!$N$39,'Eingabe Szenario'!$O$39,0)+IF('Analyse Szenario'!G3='Eingabe Szenario'!$N$40,'Eingabe Szenario'!$O$40,0)+IF('Analyse Szenario'!G3='Eingabe Szenario'!$N$41,'Eingabe Szenario'!$O$41,0)","v":0},{"$f":"IF('Analyse Szenario'!H3='Eingabe Szenario'!$N$39,'Eingabe Szenario'!$O$39,0)+IF('Analyse Szenario'!H3='Eingabe Szenario'!$N$40,'Eingabe Szenario'!$O$40,0)+IF('Analyse Szenario'!H3='Eingabe Szenario'!$N$41,'Eingabe Szenario'!$O$41,0)","v":0},{"$f":"IF('Analyse Szenario'!I3='Eingabe Szenario'!$N$39,'Eingabe Szenario'!$O$39,0)+IF('Analyse Szenario'!I3='Eingabe Szenario'!$N$40,'Eingabe Szenario'!$O$40,0)+IF('Analyse Szenario'!I3='Eingabe Szenario'!$N$41,'Eingabe Szenario'!$O$41,0)","v":0},{"$f":"IF('Analyse Szenario'!J3='Eingabe Szenario'!$N$39,'Eingabe Szenario'!$O$39,0)+IF('Analyse Szenario'!J3='Eingabe Szenario'!$N$40,'Eingabe Szenario'!$O$40,0)+IF('Analyse Szenario'!J3='Eingabe Szenario'!$N$41,'Eingabe Szenario'!$O$41,0)","v":0},{"$f":"IF('Analyse Szenario'!K3='Eingabe Szenario'!$N$39,'Eingabe Szenario'!$O$39,0)+IF('Analyse Szenario'!K3='Eingabe Szenario'!$N$40,'Eingabe Szenario'!$O$40,0)+IF('Analyse Szenario'!K3='Eingabe Szenario'!$N$41,'Eingabe Szenario'!$O$41,0)","v":0},{"$f":"IF('Analyse Szenario'!L3='Eingabe Szenario'!$N$39,'Eingabe Szenario'!$O$39,0)+IF('Analyse Szenario'!L3='Eingabe Szenario'!$N$40,'Eingabe Szenario'!$O$40,0)+IF('Analyse Szenario'!L3='Eingabe Szenario'!$N$41,'Eingabe Szenario'!$O$41,0)","v":0},{"$f":"IF('Analyse Szenario'!M3='Eingabe Szenario'!$N$39,'Eingabe Szenario'!$O$39,0)+IF('Analyse Szenario'!M3='Eingabe Szenario'!$N$40,'Eingabe Szenario'!$O$40,0)+IF('Analyse Szenario'!M3='Eingabe Szenario'!$N$41,'Eingabe Szenario'!$O$41,0)","v":0},{"$f":"IF('Analyse Szenario'!N3='Eingabe Szenario'!$N$39,'Eingabe Szenario'!$O$39,0)+IF('Analyse Szenario'!N3='Eingabe Szenario'!$N$40,'Eingabe Szenario'!$O$40,0)+IF('Analyse Szenario'!N3='Eingabe Szenario'!$N$41,'Eingabe Szenario'!$O$41,0)","v":0}]
["Mieterträge (brutto)",null,{"$f":"IF('Eingabe Szenario'!$F$14=1,'Eingabe Szenario'!$D$14,'Eingabe Szenario'!$D$15)","v":"EUR"},0,{"$f":"IF('Eingabe Szenario'!F14=1,'Eingabe Szenario'!D50,'Eingabe Szenario'!D50/1000)","v":{"v":12000,"d":"12,000"}},{"$f":"E44+E44*'Eingabe Szenario'!$D$53","v":{"v":12120,"d":"12,120"}},{"$f":"F44+F44*'Eingabe Szenario'!$D$53","v":{"v":12241.2,"d":"12,241"}},{"$f":"G44+G44*'Eingabe Szenario'!$D$53","v":{"v":12363.612000000001,"d":"12,364"}},{"$f":"H44+H44*'Eingabe Szenario'!$D$53","v":{"v":12487.24812,"d":"12,487"}},{"$f":"I44+I44*'Eingabe Szenario'!$D$53","v":{"v":12612.1206012,"d":"12,612"}},{"$f":"J44+J44*'Eingabe Szenario'!$D$53","v":{"v":12738.241807212,"d":"12,738"}},{"$f":"K44+K44*'Eingabe Szenario'!$D$53","v":{"v":12865.62422528412,"d":"12,866"}},{"$f":"L44+L44*'Eingabe Szenario'!$D$53","v":{"v":12994.28046753696,"d":"12,994"}},{"$f":"M44+M44*'Eingabe Szenario'!$D$53","v":{"v":13124.22327221233,"d":"13,124"}}]
["Erträge aus Beteiligungen",{"v":0,"d":"0.0%"},{"$f":"IF('Eingabe Szenario'!$F$14=1,'Eingabe Szenario'!$D$14,'Eingabe Szenario'!$D$15)","v":"EUR"},0,{"$f":"IF('Eingabe Szenario'!F15=1,'Eingabe Szenario'!D60,'Eingabe Szenario'!D60/1000)","v":{"v":4.4999999999999996E-5,"d":"0"}},{"$f":"F7*'Eingabe Szenario'!$D$60","v":0},{"$f":"G7*'Eingabe Szenario'!$D$60","v":0},{"$f":"H7*'Eingabe Szenario'!$D$60","v":0},{"$f":"I7*'Eingabe Szenario'!$D$60","v":0},{"$f":"J7*'Eingabe Szenario'!$D$60","v":0},{"$f":"K7*'Eingabe Szenario'!$D$60","v":0},{"$f":"L7*'Eingabe Szenario'!$D$60","v":0},{"$f":"M7*'Eingabe Szenario'!$D$60","v":0},{"$f":"N7*'Eingabe Szenario'!$D$60","v":0}]
["Wertpapiererträge (brutto)",{"$f":"'Eingabe Szenario'!D44","v":{"v":0.016800000000000002,"d":"1.7%"}},{"$f":"IF('Eingabe Szenario'!$F$14=1,'Eingabe Szenario'!$D$14,'Eingabe Szenario'!$D$15)","v":"EUR"},0,{"$f":"D9*'Eingabe Szenario'!$D$39+'Analyse Szenario'!D10*'Eingabe Szenario'!$D$40+'Analyse Szenario'!D12*'Eingabe Szenario'!$D$42+'Analyse Szenario'!D13*'Eingabe Szenario'!$D$43+D11*'Eingabe Szenario'!$D$41","v":0},{"$f":"E9*'Eingabe Szenario'!$D$39+'Analyse Szenario'!E10*'Eingabe Szenario'!$D$40+'Analyse Szenario'!E12*'Eingabe Szenario'!$D$42+'Analyse Szenario'!E13*'Eingabe Szenario'!$D$43+E11*'Eingabe Szenario'!$D$41","v":0},{"$f":"F9*'Eingabe Szenario'!$D$39+'Analyse Szenario'!F10*'Eingabe Szenario'!$D$40+'Analyse Szenario'!F12*'Eingabe Szenario'!$D$42+'Analyse Szenario'!F13*'Eingabe Szenario'!$D$43+F11*'Eingabe Szenario'!$D$41","v":{"v":2317.36800024948,"d":"2,317"}},{"$f":"G9*'Eingabe Szenario'!$D$39+'Analyse Szenario'!G10*'Eingabe Szenario'!$D$40+'Analyse Szenario'!G12*'Eingabe Szenario'!$D$42+'Analyse Szenario'!G13*'Eingabe Szenario'!$D$43+G11*'Eingabe Szenario'!$D$41","v":{"v":7513.180228733572,"d":"7,513"}},{"$f":"H9*'Eingabe Szenario'!$D$39+'Analyse Szenario'!H10*'Eingabe Szenario'!$D$40+'Analyse Szenario'!H12*'Eingabe Szenario'!$D$42+'Analyse Szenario'!H13*'Eingabe Szenario'!$D$43+H11*'Eingabe Szenario'!$D$41","v":{"v":7769.778868303704,"d":"7,770"}},{"$f":"I9*'Eingabe Szenario'!$D$39+'Analyse Szenario'!I10*'Eingabe Szenario'!$D$40+'Analyse Szenario'!I12*'Eingabe Szenario'!$D$42+'Analyse Szenario'!I13*'Eingabe Szenario'!$D$43+I11*'Eingabe Szenario'!$D$41","v":{"v":8064.125345155723,"d":"8,064"}},{"$f":"J9*'Eingabe Szenario'!$D$39+'Analyse Szenario'!J10*'Eingabe Szenario'!$D$40+'Analyse Szenario'!J12*'Eingabe Szenario'!$D$42+'Analyse Szenario'!J13*'Eingabe Szenario'!$D$43+J11*'Eingabe Szenario'!$D$41","v":{"v":8369.648782939506,"d":"8,370"}},{"$f":"K9*'Eingabe Szenario'!$D$39+'Analyse Szenario'!K10*'Eingabe Szenario'!$D$40+'Analyse Szenario'!K12*'Eingabe Szenario'!$D$42+'Analyse Szenario'!K13*'Eingabe Szenario'!$D$43+K11*'Eingabe Szenario'!$D$41","v":{"v":8686.953173872498,"d":"8,687"}},{"$f":"L9*'Eingabe Szenario'!$D$39+'Analyse Szenario'!L10*'Eingabe Szenario'!$D$40+'Analyse Szenario'!L12*'Eingabe Szenario'!$D$42+'Analyse Szenario'!L13*'Eingabe Szenario'!$D$43+L11*'Eingabe Szenario'!$D$41","v":{"v":9016.513873786682,"d":"9,017"}},{"$f":"M9*'Eingabe Szenario'!$D$39+'Analyse Szenario'!M10*'Eingabe Szenario'!$D$40+'Analyse Szenario'!M12*'Eingabe Szenario'!$D$42+'Analyse Szenario'!M13*'Eingabe Szenario'!$D$43+M11*'Eingabe Szenario'!$D$41","v":{"v":9358.826568539851,"d":"9,359"}}]
["Zinsen und ähnliche Erträge",{"$f":"'Eingabe Szenario'!D41","v":{"v":0.003,"d":"0.3%"}},{"$f":"IF('Eingabe Szenario'!$F$14=1,'Eingabe Szenario'!$D$14,'Eingabe Szenario'!$D$15)","v":"EUR"},0,{"$f":"E14*'Eingabe Szenario'!$D$41","v":0},{"$f":"F14*'Eingabe Szenario'!$D$41","v":0},{"$f":"G14*'Eingabe Szenario'!$D$41","v":0},{"$f":"H14*'Eingabe Szenario'!$D$41","v":0},{"$f":"I14*'Eingabe Szenario'!$D$41","v":0},{"$f":"J14*'Eingabe Szenario'!$D$41","v":0},{"$f":"K14*'Eingabe Szenario'!$D$41","v":0},{"$f":"L14*'Eingabe Szenario'!$D$41","v":0},{"$f":"M14*'Eingabe Szenario'!$D$41","v":0},{"$f":"N14*'Eingabe Szenario'!$D$41","v":0}]
["Erträge aus sonstigem Vermögen",{"$f":"'Eingabe Szenario'!D70","v":{"v":0,"d":"0.0%"}},{"$f":"IF('Eingabe Szenario'!$F$14=1,'Eingabe Szenario'!$D$14,'Eingabe Szenario'!$D$15)","v":"EUR"},0,{"$f":"E15*'Eingabe Szenario'!$D$41","v":0},{"$f":"F15*'Eingabe Szenario'!$D$41","v":0},{"$f":"G15*'Eingabe Szenario'!$D$41","v":0},{"$f":"H15*'Eingabe Szenario'!$D$41","v":0},{"$f":"I15*'Eingabe Szenario'!$D$41","v":0},{"$f":"J15*'Eingabe Szenario'!$D$41","v":0},{"$f":"K15*'Eingabe Szenario'!$D$41","v":0},{"$f":"L15*'Eingabe Szenario'!$D$41","v":0},{"$f":"M15*'Eingabe Szenario'!$D$41","v":0},{"$f":"N15*'Eingabe Szenario'!$D$41","v":0}]
["Ausgaben",null,{"$f":"IF('Eingabe Szenario'!$F$14=1,'Eingabe Szenario'!$D$14,'Eingabe Szenario'!$D$15)","v":"EUR"},0,{"$f":"SUM(E50:E52)+SUM(E56:E60)","v":{"$error":"#REF!"}},{"$f":"SUM(F50:F52)+SUM(F56:F60)","v":{"$error":"#REF!"}},{"$error":"#REF!"},{"$error":"#REF!"},{"$error":"#REF!"},{"$error":"#REF!"},{"$error":"#REF!"},{"$error":"#REF!"},{"$error":"#REF!"},{"$error":"#REF!"}]
["Ausgaben für den Stiftungszweck",{"$f":"IF('Eingabe Szenario'!F10=1,\"Überschuss\",\"Zielausschüttg.\")","v":"Überschuss"},{"$f":"IF('Eingabe Szenario'!$F$14=1,'Eingabe Szenario'!$D$14,'Eingabe Szenario'!$D$15)","v":"EUR"},0,{"$f":"IF('Eingabe Szenario'!$F$14=1,IF('Eingabe Szenario'!$F$10=1,E41-E51-E52-E56-E58-E59-E60,'Eingabe Szenario'!$C$11),IF('Eingabe Szenario'!$F$10=1,E41-E51-E52-E56-E58-E59-E60,'Eingabe Szenario'!$C$11/1000))","v":{"$error":"#REF!"}},{"$f":"IF('Eingabe Szenario'!$F$14=1,IF('Eingabe Szenario'!$F$10=1,F41-F51-F52-F56-F58-F59-F60,'Eingabe Szenario'!$C$11),IF('Eingabe Szenario'!$F$10=1,F41-F51-F52-F56-F58-F59-F60,'Eingabe Szenario'!$C$11/1000))","v":{"$error":"#REF!"}},{"$f":"IF('Eingabe Szenario'!$F$14=1,IF('Eingabe Szenario'!$F$10=1,G41-G51-G52-G56-G58-G59-G60,'Eingabe Szenario'!$C$11),IF('Eingabe Szenario'!$F$10=1,G41-G51-G52-G56-G58-G59-G60,'Eingabe Szenario'!$C$11/1000))","v":{"$error":"#REF!"}},{"$f":"IF('Eingabe Szenario'!$F$14=1,IF('Eingabe Szenario'!$F$10=1,H41-H51-H52-H56-H58-H59-H60,'Eingabe Szenario'!$C$11),IF('Eingabe Szenario'!$F$10=1,H41-H51-H52-H56-H58-H59-H60,'Eingabe Szenario'!$C$11/1000))","v":{"$error":"#REF!"}},{"$f":"IF('Eingabe Szenario'!$F$14=1,IF('Eingabe Szenario'!$F$10=1,I41-I51-I52-I56-I58-I59-I60,'Eingabe Szenario'!$C$11),IF('Eingabe Szenario'!$F$10=1,I41-I51-I52-I56-I58-I59-I60,'Eingabe Szenario'!$C$11/1000))","v":{"$error":"#REF!"}},{"$f":"IF('Eingabe Szenario'!$F$14=1,IF('Eingabe Szenario'!$F$10=1,J41-J51-J52-J56-J58-J59-J60,'Eingabe Szenario'!$C$11),IF('Eingabe Szenario'!$F$10=1,J41-J51-J52-J56-J58-J59-J60,'Eingabe Szenario'!$C$11/1000))","v":{"$error":"#REF!"}},{"$f":"IF('Eingabe Szenario'!$F$14=1,IF('Eingabe Szenario'!$F$10=1,K41-K51-K52-K56-K58-K59-K60,'Eingabe Szenario'!$C$11),IF('Eingabe Szenario'!$F$10=1,K41-K51-K52-K56-K58-K59-K60,'Eingabe Szenario'!$C$11/1000))","v":{"$error":"#REF!"}},{"$f":"IF('Eingabe Szenario'!$F$14=1,IF('Eingabe Szenario'!$F$10=1,L41-L51-L52-L56-L58-L59-L60,'Eingabe Szenario'!$C$11),IF('Eingabe Szenario'!$F$10=1,L41-L51-L52-L56-L58-L59-L60,'Eingabe Szenario'!$C$11/1000))","v":{"$error":"#REF!"}},{"$f":"IF('Eingabe Szenario'!$F$14=1,IF('Eingabe Szenario'!$F$10=1,M41-M51-M52-M56-M58-M59-M60,'Eingabe Szenario'!$C$11),IF('Eingabe Szenario'!$F$10=1,M41-M51-M52-M56-M58-M59-M60,'Eingabe Szenario'!$C$11/1000))","v":{"$error":"#REF!"}},{"$f":"IF('Eingabe Szenario'!$F$14=1,IF('Eingabe Szenario'!$F$10=1,N41-N51-N52-N56-N58-N59-N60,'Eingabe Szenario'!$C$11),IF('Eingabe Szenario'!$F$10=1,N41-N51-N52-N56-N58-N59-N60,'Eingabe Szenario'!$C$11/1000))","v":{"$error":"#REF!"}}]
["Allg. Verwaltungskosten",null,{"$f":"IF('Eingabe Szenario'!$F$14=1,'Eingabe Szenario'!$D$14,'Eingabe Szenario'!$D$15)","v":"EUR"},0,{"$f":"IF('Eingabe Szenario'!$F$14=1,'Eingabe Szenario'!K18,'Eingabe Szenario'!K18/1000)","v":{"v":10000,"d":"10,000"}},{"$f":"E51+E51*'Eingabe Szenario'!$C$9","v":{"v":10150,"d":"10,150"}},{"$f":"F51+F51*'Eingabe Szenario'!$C$9","v":{"v":10302.25,"d":"10,302"}},{"$f":"G51+G51*'Eingabe Szenario'!$C$9","v":{"v":10456.78375,"d":"10,457"}},{"$f":"H51+H51*'Eingabe Szenario'!$C$9","v":{"v":10613.63550625,"d":"10,614"}},{"$f":"I51+I51*'Eingabe Szenario'!$C$9","v":{"v":10772.840038843751,"d":"10,773"}},{"$f":"J51+J51*'Eingabe Szenario'!$C$9","v":{"v":10934.432639426408,"d":"10,934"}},{"$f":"K51+K51*'Eingabe Szenario'!$C$9","v":{"v":11098.449129017805,"d":"11,098"}},{"$f":"L51+L51*'Eingabe Szenario'!$C$9","v":{"v":11264.925865953071,"d":"11,265"}},{"$f":"M51+M51*'Eingabe Szenario'!$C$9","v":{"v":11433.899753942367,"d":"11,434"}}]
["Kosten Vermögensverwaltung",null,{"$f":"IF('Eingabe Szenario'!$F$14=1,'Eingabe Szenario'!$D$14,'Eingabe Szenario'!$D$15)","v":"EUR"},0,{"$f":"SUM(E53:E55)","v":{"v":15000,"d":"15,000"}},{"$f":"SUM(F53:F55)","v":{"v":15632.0800001188,"d":"15,632"}},{"v":18087.321388920387,"d":"18,087"},{"v":18182.39190331707,"d":"18,182"},{"v":18294.391897520785,"d":"18,294"},{"v":18410.59272185299,"d":"18,411"},{"v":18531.24410488394,"d":"18,531"},{"v":18656.533208275756,"d":"18,657"},{"v":18786.655755235173,"d":"18,787"},{"v":18921.8160085371,"d":"18,922"}]
[" davon Immobilien",null,{"$f":"IF('Eingabe Szenario'!$F$14=1,'Eingabe Szenario'!$D$14,'Eingabe Szenario'!$D$15)","v":"EUR"},0,{"$f":"IF('Eingabe Szenario'!$F$14=1,'Eingabe Szenario'!$D$51,'Eingabe Szenario'!$D$51/1000)","v":{"v":5000,"d":"5,000"}},{"$f":"IF('Eingabe Szenario'!$F$14=1,'Eingabe Szenario'!$D$51,'Eingabe Szenario'!$D$51/1000)","v":{"v":5000,"d":"5,000"}},{"$f":"IF('Eingabe Szenario'!$F$14=1,'Eingabe Szenario'!$D$51,'Eingabe Szenario'!$D$51/1000)","v":{"v":5000,"d":"5,000"}},{"$f":"IF('Eingabe Szenario'!$F$14=1,'Eingabe Szenario'!$D$51,'Eingabe Szenario'!$D$51/1000)","v":{"v":5000,"d":"5,000"}},{"$f":"IF('Eingabe Szenario'!$F$14=1,'Eingabe Szenario'!$D$51,'Eingabe Szenario'!$D$51/1000)","v":{"v":5000,"d":"5,000"}},{"$f":"IF('Eingabe Szenario'!$F$14=1,'Eingabe Szenario'!$D$51,'Eingabe Szenario'!$D$51/1000)","v":{"v":5000,"d":"5,000"}},{"$f":"IF('Eingabe Szenario'!$F$14=1,'Eingabe Szenario'!$D$51,'Eingabe Szenario'!$D$51/1000)","v":{"v":5000,"d":"5,000"}},{"$f":"IF('Eingabe Szenario'!$F$14=1,'Eingabe Szenario'!$D$51,'Eingabe Szenario'!$D$51/1000)","v":{"v":5000,"d":"5,000"}},{"$f":"IF('Eingabe Szenario'!$F$14=1,'Eingabe Szenario'!$D$51,'Eingabe Szenario'!$D$51/1000)","v":{"v":5000,"d":"5,000"}},{"$f":"IF('Eingabe Szenario'!$F$14=1,'Eingabe Szenario'!$D$51,'Eingabe Szenario'!$D$51/1000)","v":{"v":5000,"d":"5,000"}}]
[" davon Beteiligungen",null,{"$f":"IF('Eingabe Szenario'!$F$14=1,'Eingabe Szenario'!$D$14,'Eingabe Szenario'!$D$15)","v":"EUR"},0,{"$f":"IF('Eingabe Szenario'!$F$14=1,'Eingabe Szenario'!$D$63+'Analyse Szenario'!E7*'Eingabe Szenario'!$D$64,('Eingabe Szenario'!$D$63+E7*$B$59)/1000)","v":0},{"$f":"IF('Eingabe Szenario'!$F$14=1,'Eingabe Szenario'!$D$63+'Analyse Szenario'!F7*'Eingabe Szenario'!$D$64,('Eingabe Szenario'!$D$63+F7*$B$59)/1000)","v":0},{"$f":"IF('Eingabe Szenario'!$F$14=1,'Eingabe Szenario'!$D$63+'Analyse Szenario'!G7*'Eingabe Szenario'!$D$64,('Eingabe Szenario'!$D$63+G7*$B$59)/1000)","v":0},{"$f":"IF('Eingabe Szenario'!$F$14=1,'Eingabe Szenario'!$D$63+'Analyse Szenario'!H7*'Eingabe Szenario'!$D$64,('Eingabe Szenario'!$D$63+H7*$B$59)/1000)","v":0},{"$f":"IF('Eingabe Szenario'!$F$14=1,'Eingabe Szenario'!$D$63+'Analyse Szenario'!I7*'Eingabe Szenario'!$D$64,('Eingabe Szenario'!$D$63+I7*$B$59)/1000)","v":0},{"$f":"IF('Eingabe Szenario'!$F$14=1,'Eingabe Szenario'!$D$63+'Analyse Szenario'!J7*'Eingabe Szenario'!$D$64,('Eingabe Szenario'!$D$63+J7*$B$59)/1000)","v":0},{"$f":"IF('Eingabe Szenario'!$F$14=1,'Eingabe Szenario'!$D$63+'Analyse Szenario'!K7*'Eingabe Szenario'!$D$64,('Eingabe Szenario'!$D$63+K7*$B$59)/1000)","v":0},{"$f":"IF('Eingabe Szenario'!$F$14=1,'Eingabe Szenario'!$D$63+'Analyse Szenario'!L7*'Eingabe Szenario'!$D$64,('Eingabe Szenario'!$D$63+L7*$B$59)/1000)","v":0},{"$f":"IF('Eingabe Szenario'!$F$14=1,'Eingabe Szenario'!$D$63+'Analyse Szenario'!M7*'Eingabe Szenario'!$D$64,('Eingabe Szenario'!$D$63+M7*$B$59)/1000)","v":0},{"$f":"IF('Eingabe Szenario'!$F$14=1,'Eingabe Szenario'!$D$63+'Analyse Szenario'!N7*'Eingabe Szenario'!$D$64,('Eingabe Szenario'!$D$63+N7*$B$59)/1000)","v":0}]
[" davon Wertpapiere",null,{"$f":"IF('Eingabe Szenario'!$F$14=1,'Eingabe Szenario'!$D$14,'Eingabe Szenario'!$D$15)","v":"EUR"},0,{"$f":"IF('Eingabe Szenario'!$F$14=1,'Eingabe Szenario'!$K$21+'Analyse Szenario'!E8*'Eingabe Szenario'!$K$22,'Eingabe Szenario'!$K$21/1000+'Analyse Szenario'!E8*'Eingabe Szenario'!$K$22)","v":{"v":10000,"d":"10,000"}},{"$f":"IF('Eingabe Szenario'!$F$14=1,'Eingabe Szenario'!$K$21+'Analyse Szenario'!F8*'Eingabe Szenario'!$K$22,'Eingabe Szenario'!$K$21/1000+'Analyse Szenario'!F8*'Eingabe Szenario'!$K$22)","v":{"v":10632.0800001188,"d":"10,632"}},{"$f":"IF('Eingabe Szenario'!$F$14=1,'Eingabe Szenario'!$K$21+'Analyse Szenario'!G8*'Eingabe Szenario'!$K$22,'Eingabe Szenario'!$K$21/1000+'Analyse Szenario'!G8*'Eingabe Szenario'!$K$22)","v":{"v":13087.321388920387,"d":"13,087"}},{"$f":"IF('Eingabe Szenario'!$F$14=1,'Eingabe Szenario'!$K$21+'Analyse Szenario'!H8*'Eingabe Szenario'!$K$22,'Eingabe Szenario'!$K$21/1000+'Analyse Szenario'!H8*'Eingabe Szenario'!$K$22)","v":{"v":13182.391903317071,"d":"13,182"}},{"$f":"IF('Eingabe Szenario'!$F$14=1,'Eingabe Szenario'!$K$21+'Analyse Szenario'!I8*'Eingabe Szenario'!$K$22,'Eingabe Szenario'!$K$21/1000+'Analyse Szenario'!I8*'Eingabe Szenario'!$K$22)","v":{"v":13294.391897520787,"d":"13,294"}},{"$f":"IF('Eingabe Szenario'!$F$14=1,'Eingabe Szenario'!$K$21+'Analyse Szenario'!J8*'Eingabe Szenario'!$K$22,'Eingabe Szenario'!$K$21/1000+'Analyse Szenario'!J8*'Eingabe Szenario'!$K$22)","v":{"v":13410.592721852989,"d":"13,411"}},{"$f":"IF('Eingabe Szenario'!$F$14=1,'Eingabe Szenario'!$K$21+'Analyse Szenario'!K8*'Eingabe Szenario'!$K$22,'Eingabe Szenario'!$K$21/1000+'Analyse Szenario'!K8*'Eingabe Szenario'!$K$22)","v":{"v":13531.244104883937,"d":"13,531"}},{"$f":"IF('Eingabe Szenario'!$F$14=1,'Eingabe Szenario'!$K$21+'Analyse Szenario'!L8*'Eingabe Szenario'!$K$22,'Eingabe Szenario'!$K$21/1000+'Analyse Szenario'!L8*'Eingabe Szenario'!$K$22)","v":{"v":13656.533208275756,"d":"13,657"}},{"$f":"IF('Eingabe Szenario'!$F$14=1,'Eingabe Szenario'!$K$21+'Analyse Szenario'!M8*'Eingabe Szenario'!$K$22,'Eingabe Szenario'!$K$21/1000+'Analyse Szenario'!M8*'Eingabe Szenario'!$K$22)","v":{"v":13786.655755235175,"d":"13,787"}},{"$f":"IF('Eingabe Szenario'!$F$14=1,'Eingabe Szenario'!$K$21+'Analyse Szenario'!N8*'Eingabe Szenario'!$K$22,'Eingabe Szenario'!$K$21/1000+'Analyse Szenario'!N8*'Eingabe Szenario'!$K$22)","v":{"v":13921.8160085371,"d":"13,922"}}]
["Sollzinsen",null,{"$f":"IF('Eingabe Szenario'!$F$14=1,'Eingabe Szenario'!$D$14,'Eingabe Szenario'!$D$15)","v":"EUR"},0,{"$f":"IF('Eingabe Szenario'!$F$14=1,'Eingabe Szenario'!#REF!*'Eingabe Szenario'!$D$74,'Eingabe Szenario'!#REF!*'Eingabe Szenario'!$D$74/1000)","v":{"$error":"#REF!"}},{"$f":"IF('Eingabe Szenario'!$F$14=1,'Eingabe Szenario'!#REF!*'Eingabe Szenario'!$D$74,'Eingabe Szenario'!#REF!*'Eingabe Szenario'!$D$74/1000)","v":{"$error":"#REF!"}},{"$f":"IF('Eingabe Szenario'!$F$14=1,'Eingabe Szenario'!#REF!*'Eingabe Szenario'!$D$74,'Eingabe Szenario'!#REF!*'Eingabe Szenario'!$D$74/1000)","v":{"$error":"#REF!"}},{"$f":"IF('Eingabe Szenario'!$F$14=1,'Eingabe Szenario'!#REF!*'Eingabe Szenario'!$D$74,'Eingabe Szenario'!#REF!*'Eingabe Szenario'!$D$74/1000)","v":{"$error":"#REF!"}},{"$f":"IF('Eingabe Szenario'!$F$14=1,'Eingabe Szenario'!#REF!*'Eingabe Szenario'!$D$74,'Eingabe Szenario'!#REF!*'Eingabe Szenario'!$D$74/1000)","v":{"$error":"#REF!"}},{"$f":"IF('Eingabe Szenario'!$F$14=1,'Eingabe Szenario'!#REF!*'Eingabe Szenario'!$D$74,'Eingabe Szenario'!#REF!*'Eingabe Szenario'!$D$74/1000)","v":{"$error":"#REF!"}},{"$f":"IF('Eingabe Szenario'!$F$14=1,'Eingabe Szenario'!#REF!*'Eingabe Szenario'!$D$74,'Eingabe Szenario'!#REF!*'Eingabe Szenario'!$D$74/1000)","v":{"$error":"#REF!"}},{"$f":"IF('Eingabe Szenario'!$F$14=1,'Eingabe Szenario'!#REF!*'Eingabe Szenario'!$D$74,'Eingabe Szenario'!#REF!*'Eingabe Szenario'!$D$74/1000)","v":{"$error":"#REF!"}},{"$f":"IF('Eingabe Szenario'!$F$14=1,'Eingabe Szenario'!#REF!*'Eingabe Szenario'!$D$74,'Eingabe Szenario'!#REF!*'Eingabe Szenario'!$D$74/1000)","v":{"$error":"#REF!"}},{"$f":"IF('Eingabe Szenario'!$F$14=1,'Eingabe Szenario'!#REF!*'Eingabe Szenario'!$D$74,'Eingabe Szenario'!#REF!*'Eingabe Szenario'!$D$74/1000)","v":{"$error":"#REF!"}}]
["Tilgung",null,"EUR",0]
["Sonstige Aufwände",null,{"$f":"IF('Eingabe Szenario'!$F$14=1,'Eingabe Szenario'!$D$14,'Eingabe Szenario'!$D$15)","v":"EUR"},0,{"$f":"IF('Eingabe Szenario'!$F$14=1,'Eingabe Szenario'!K23,'Eingabe Szenario'!K23/1000)","v":0},{"$f":"E58+E58*$B$58","v":0},0,0,0,0,0,0,0,0]
["Zuführung Freie Rücklage",{"$f":"'Eingabe Szenario'!K30","v":{"v":0.33,"d":"33.0%"}},{"$f":"IF('Eingabe Szenario'!$F$14=1,'Eingabe Szenario'!$D$14,'Eingabe Szenario'!$D$15)","v":"EUR"},{"$f":"D42*10%+(D44+D46+D47+D45-D52)*$B$59","v":0},{"$f":"E42*'Eingabe Szenario'!$K$31+(E44+E46+E47+E45-E52)*'Eingabe Szenario'!$K$30","v":{"v":4010.0000148500003,"d":"4,010"}},{"$f":"F42*'Eingabe Szenario'!$K$31+(F44+F46+F47+F45-F52)*'Eingabe Szenario'!$K$30","v":{"v":3841.013599960796,"d":"3,841"}},{"$f":"G42*'Eingabe Szenario'!$K$31+(G44+G46+G47+G45-G52)*'Eingabe Szenario'!$K$30","v":{"v":3835.511381738601,"d":"3,836"}},{"$f":"H42*'Eingabe Szenario'!$K$31+(H44+H46+H47+H45-H52)*'Eingabe Szenario'!$K$30","v":{"v":5559.152107387446,"d":"5,559"}},{"$f":"I42*'Eingabe Szenario'!$K$31+(I44+I46+I47+I45-I52)*'Eingabe Szenario'!$K$30","v":{"v":5647.669579958363,"d":"5,648"}},{"$f":"J42*'Eingabe Szenario'!$K$31+(J44+J46+J47+J45-J52)*'Eingabe Szenario'!$K$30","v":{"v":5747.665564085903,"d":"5,748"}},{"$f":"K42*'Eingabe Szenario'!$K$31+(K44+K46+K47+K45-K52)*'Eingabe Szenario'!$K$30","v":{"v":5850.293340138297,"d":"5,850"}},{"$f":"L42*'Eingabe Szenario'!$K$31+(L44+L46+L47+L45-L52)*'Eingabe Szenario'!$K$30","v":{"v":5955.6945829906845,"d":"5,956"}},{"$f":"M42*'Eingabe Szenario'!$K$31+(M44+M46+M47+M45-M52)*'Eingabe Szenario'!$K$30","v":{"v":6063.965733409195,"d":"6,064"}},{"$f":"N42*'Eingabe Szenario'!$K$31+(N44+N46+N47+N45-N52)*'Eingabe Szenario'!$K$30","v":{"v":6175.207164630978,"d":"6,175"}}]
["Neuanlage",null,{"$f":"IF('Eingabe Szenario'!$F$14=1,'Eingabe Szenario'!$D$14,'Eingabe Szenario'!$D$15)","v":"EUR"},{"$f":"D43","v":0},{"$f":"E43","v":0},{"$f":"F43","v":{"v":300000,"d":"300,000"}},0,0,0,0,0,0,0,{"$f":"N43","v":0}]
["Kennzahlen",null,null," "]
["Ausschüttungsrendite brutto",null,"%",{"v":0,"d":"0.0%"},{"$f":"SUM(E44:E47)/(SUM(E6:E8)+SUM(E14:E15))","v":{"$error":"#DIV/0!"}},{"$f":"SUM(F44:F47)/(F6+F7+F8+F14)","v":{"v":0.15339830398331905,"d":"15.3%"}},{"v":0.037724787714026764,"d":"3.8%"},{"v":0.04996692508679549,"d":"5.0%"},{"v":0.04919154154925707,"d":"4.9%"},{"v":0.04849889185272696,"d":"4.8%"},{"v":0.04781972576964122,"d":"4.8%"},{"v":0.047154123693726305,"d":"4.7%"},{"v":0.046501812182727205,"d":"4.7%"},{"v":0.04586252856699154,"d":"4.6%"}]
["Verwaltungskostenquote (Aufsicht)",null,"%",{"v":0,"d":"0.0%"},{"$f":"(E51+E52)/E41","v":{"v":0.403225806158949,"d":"40.3%"}},{"$f":"(F51+F52)/F41","v":{"v":0.07119761405091903,"d":"7.1%"}},{"v":0.43974908781760275,"d":"44.0%"},{"v":0.40985246660393415,"d":"41.0%"},{"v":0.4114610117018381,"d":"41.1%"},{"v":0.41291713177362843,"d":"41.3%"},{"v":0.41437984589000537,"d":"41.4%"},{"v":0.41584780617063116,"d":"41.6%"},{"v":0.4173205127934971,"d":"41.7%"},{"v":0.4187974406315965,"d":"41.9%"}]
["Verwaltungskostenquote (Finanzamt)",null,"%",{"v":0,"d":"0.0%"},{"$f":"E51/(E41-E52)","v":{"v":0.2127659572430964,"d":"21.3%"}},{"$f":"F51/(F41-F52)","v":{"v":0.0292939505654439,"d":"2.9%"}},{"v":0.22169084651773566,"d":"22.2%"},{"v":0.20228078252527346,"d":"20.2%"},{"v":0.20425514386841856,"d":"20.4%"},{"v":0.2061170075225104,"d":"20.6%"},{"v":0.20797128326718842,"d":"20.8%"},{"v":0.20981624049178235,"d":"21.0%"},{"v":0.21165069393715757,"d":"21.2%"},{"v":0.21347341978267317,"d":"21.3%"}]
["Zweckeffizienz der Erträge",null,"%",{"v":0,"d":"0.0%"},{"$f":"E50/E41","v":{"$error":"#REF!"}},{"$f":"F50/F41","v":{"$error":"#REF!"}},{"$error":"#REF!"},{"$error":"#REF!"},{"$error":"#REF!"},{"$error":"#REF!"},{"$error":"#REF!"},{"$error":"#REF!"},{"$error":"#REF!"},{"$error":"#REF!"}]
["Zweckeffizienz des Vermögens",null,"%",{"$f":"D50/D5","v":{"v":0,"d":"0.0%"}},{"$error":"#REF!"},{"$error":"#REF!"},{"$error":"#REF!"},{"$error":"#REF!"},{"$error":"#REF!"},{"$error":"#REF!"},{"$error":"#REF!"},{"$error":"#REF!"},{"$error":"#REF!"},{"$error":"#REF!"}]

{"sheet":"Verwaltungskosten","index":22,"n_rows":41,"n_cols":13,"rows_kept":41,"hidden":true}
["Verwaltungskosten"]
[]
["1. Aufsicht"]
[]
["Beschreibung",null,"Einh.",{"$f":"Einstellungen!D7","v":2019},{"$f":"D5+1","v":2020},2021,2022,2023,2024,2025,2026,2027,2028]
[]
["Ausgangsfall"]
["Einnahmen",null,"EUR",{"$f":"'Zahlen Basis'!F31","v":{"v":63500,"d":"63,500"}},{"$f":"'Zahlen Basis'!G31","v":{"v":64248.75,"d":"64,249"}},{"$f":"'Zahlen Basis'!H31","v":{"v":65013.93125,"d":"65,014"}},{"$f":"'Zahlen Basis'!I31","v":{"v":65795.99653125,"d":"65,796"}},{"$f":"'Zahlen Basis'!J31","v":{"v":66595.41190765626,"d":"66,595"}},{"$f":"'Zahlen Basis'!#REF!","v":{"$error":"#REF!"}},{"$f":"'Zahlen Basis'!#REF!","v":{"$error":"#REF!"}},{"$f":"'Zahlen Basis'!#REF!","v":{"$error":"#REF!"}},{"$f":"'Zahlen Basis'!#REF!","v":{"$error":"#REF!"}},{"$f":"'Zahlen Basis'!#REF!","v":{"$error":"#REF!"}}]
["Verwaltungskosten",null,"EUR",{"$f":"'Zahlen Basis'!F41+'Zahlen Basis'!F42","v":{"v":39220,"d":"39,220"}},{"$f":"'Zahlen Basis'!G41+'Zahlen Basis'!G42","v":{"v":38474.4,"d":"38,474"}},{"$f":"'Zahlen Basis'!H41+'Zahlen Basis'!H42","v":{"v":39243.888000000006,"d":"39,244"}},{"$f":"'Zahlen Basis'!I41+'Zahlen Basis'!I42","v":{"v":40028.765759999995,"d":"40,029"}},{"$f":"'Zahlen Basis'!J41+'Zahlen Basis'!J42","v":{"v":40829.341075200005,"d":"40,829"}},{"$f":"'Zahlen Basis'!#REF!+'Zahlen Basis'!#REF!","v":{"$error":"#REF!"}},{"$f":"'Zahlen Basis'!#REF!+'Zahlen Basis'!#REF!","v":{"$error":"#REF!"}},{"$f":"'Zahlen Basis'!#REF!+'Zahlen Basis'!#REF!","v":{"$error":"#REF!"}},{"$f":"'Zahlen Basis'!#REF!+'Zahlen Basis'!#REF!","v":{"$error":"#REF!"}},{"$f":"'Zahlen Basis'!#REF!+'Zahlen Basis'!#REF!","v":{"$error":"#REF!"}}]
["Quote",null,"%",{"$f":"D9/D8","v":{"v":0.6176377952755906,"d":"61.8%"}},{"$f":"E9/E8","v":{"v":0.5988349967898209,"d":"59.9%"}},{"v":0.6036227504701157,"d":"60.4%"},{"v":0.6083769206381457,"d":"60.8%"},{"v":0.6130954056086555,"d":"61.3%"},{"$error":"#REF!"},{"$error":"#REF!"},{"$error":"#REF!"},{"$error":"#REF!"},{"$error":"#REF!"}]
["Untere Grenze",{"$f":"Einstellungen!#REF!","v":{"$error":"#REF!"}},"%",{"$f":"D8*$B$11","v":{"$error":"#REF!"}},{"$error":"#REF!"},{"$error":"#REF!"},{"$error":"#REF!"},{"$error":"#REF!"},{"$error":"#REF!"},{"$error":"#REF!"},{"$error":"#REF!"},{"$error":"#REF!"},{"$error":"#REF!"}]
["Obere Grenze",{"$f":"Einstellungen!#REF!","v":{"$error":"#REF!"}},"%",{"$f":"D8*$B$12","v":{"$error":"#REF!"}},{"$error":"#REF!"},{"$error":"#REF!"},{"$error":"#REF!"},{"$error":"#REF!"},{"$error":"#REF!"},{"$error":"#REF!"},{"$error":"#REF!"},{"$error":"#REF!"},{"$error":"#REF!"}]
[]
["Szenario 1"]
["Einnahmen",null,"EUR",{"$f":"#REF!","v":{"$error":"#REF!"}},{"$f":"#REF!","v":{"$error":"#REF!"}},{"$f":"#REF!","v":{"$error":"#REF!"}},{"$f":"#REF!","v":{"$error":"#REF!"}},{"$f":"#REF!","v":{"$error":"#REF!"}},{"$f":"#REF!","v":{"$error":"#REF!"}},{"$f":"#REF!","v":{"$error":"#REF!"}},{"$f":"#REF!","v":{"$error":"#REF!"}},{"$f":"#REF!","v":{"$error":"#REF!"}},{"$f":"#REF!","v":{"$error":"#REF!"}}]
["Verwaltungskosten",null,"EUR",{"$f":"#REF!+#REF!","v":{"$error":"#REF!"}},{"$f":"#REF!+#REF!","v":{"$error":"#REF!"}},{"$f":"#REF!+#REF!","v":{"$error":"#REF!"}},{"$f":"#REF!+#REF!","v":{"$error":"#REF!"}},{"$f":"#REF!+#REF!","v":{"$error":"#REF!"}},{"$f":"#REF!+#REF!","v":{"$error":"#REF!"}},{"$f":"#REF!+#REF!","v":{"$error":"#REF!"}},{"$f":"#REF!+#REF!","v":{"$error":"#REF!"}},{"$f":"#REF!+#REF!","v":{"$error":"#REF!"}},{"$f":"#REF!+#REF!","v":{"$error":"#REF!"}}]
["Quote",null,"%",{"$f":"D16/D15","v":{"$error":"#REF!"}},{"$f":"E16/E15","v":{"$error":"#REF!"}},{"$error":"#REF!"},{"$error":"#REF!"},{"$error":"#REF!"},{"$error":"#REF!"},{"$error":"#REF!"},{"$error":"#REF!"},{"$error":"#REF!"},{"$error":"#REF!"}]
["Untere Grenze",{"$f":"Einstellungen!#REF!","v":{"$error":"#REF!"}},"%",{"$f":"D15*$B$18","v":{"$error":"#REF!"}},{"$error":"#REF!"},{"$error":"#REF!"},{"$error":"#REF!"},{"$error":"#REF!"},{"$error":"#REF!"},{"$error":"#REF!"},{"$error":"#REF!"},{"$error":"#REF!"},{"$error":"#REF!"}]
["Obere Grenze",{"$f":"Einstellungen!#REF!","v":{"$error":"#REF!"}},"%",{"$f":"D15*$B$19","v":{"$error":"#REF!"}},{"$error":"#REF!"},{"$error":"#REF!"},{"$error":"#REF!"},{"$error":"#REF!"},{"$error":"#REF!"},{"$error":"#REF!"},{"$error":"#REF!"},{"$error":"#REF!"},{"$error":"#REF!"}]
{"$rows_empty":21}
["2. Finanzamt"]

{"sheet":"Druck","index":23,"n_rows":427,"n_cols":6,"rows_kept":427,"hidden":true,"merged":[[15,3,16,5],[22,3,23,5],[117,0,118,3],[128,0,129,1],[132,0,133,1],[132,3,133,4],[134,0,135,1],[136,0,137,1],[138,1,139,2],[139,0,140,0],[140,1,141,2],[142,0,143,1],[144,0,145,1],[146,0,147,1],[148,0,149,1],[150,0,151,1],[155,0,155,6],[177,0,178,1],[238,0,239,1],[240,0,241,3],[300,0,301,3],[302,0,303,3],[362,0,363,3],[364,0,365,3],[424,0,425,3],[426,0,427,3]]}
{"$rows_empty":15}
[{"$nulls":3},"Stiftungsfinanzplan"]
[]
[]
[]
[]
[{"$nulls":3},"für:"]
[]
[{"$nulls":3},{"$f":"Einstellungen!D5","v":"Paradigma-Stiftung"}]
[]
[]
[]
[]
[{"$nulls":3},"erstellt von:"]
[]
[{"$nulls":3},{"$f":"IF(Einstellungen!K6=\"Herr\",\"Herrn\",\"Frau\")","v":"Frau"},{"$f":"Einstellungen!L6","v":0}]
[]
[]
[]
[]
[]
[{"$nulls":3},{"$f":"IF(Einstellungen!#REF!=1,\"Frau\",\"Herrn\")","v":{"$error":"#REF!"}},{"$f":"Einstellungen!L8","v":0}]
[]
[{"$nulls":3},"und"]
[]
[{"$nulls":3},{"$f":"IF(Einstellungen!#REF!=1,\"Frau\",\"Herrn\")","v":{"$error":"#REF!"}},{"$f":"Einstellungen!L7","v":0}]
{"$rows_empty":31}
["1. Vorwort"]
[]
[]
[{"$f":"IF(Einstellungen!#REF!=1,\"Sehr geehrte\",\"Sehr geehrter\")","v":{"$error":"#REF!"}},{"$f":"Einstellungen!L6","v":0}]
{"$rows_empty":19}
["München, im November 2015"]
[]
[]
[]
[{"$f":"Einstellungen!L8","v":0},null,{"$f":"Einstellungen!L7","v":0}]
{"$rows_empty":18}
["2. Ausgangssituation"]
{"$rows_empty":10}
["Rahmendaten:"]
[]
[]
[]
["Aktuelles Gesamtvermögen",null,null,{"$f":"'Zahlen Basis'!E6","v":{"v":7600000,"d":"7,600,000"}}]
[{"$nulls":5},"EUR"]
["Allokationszeitpunkt"]
[{"$nulls":3},"Jeweils zum 01.01. des Jahres - beginnend 2016"]
["Neuallokation"]
[{"$nulls":3},"Entsprechend bestehender Allokation"]
[null,"Ausgangsfall:"]
["Szenarien",null,null,{"$f":"Einstellungen!#REF!","v":{"$error":"#REF!"}}]
[null,"Szenario:"]
[{"$nulls":3},{"$f":"'Eingabe Szenario'!B2","v":0}]
["Ø Geldentwertung (VPI)"]
[{"$nulls":3},{"$f":"Einstellungen!#REF!","v":{"$error":"#REF!"}}]
["Satzungsmäßige Leistungen"]
[{"$nulls":3},{"$f":"IF(Einstellungen!R8=1,\"Aus Überschüssen nach Kosten und Rücklagen\",\"Fixe Zielausschüttung\")","v":"Aus Überschüssen nach Kosten und Rücklagen"}]
["Kosten Vermögensverwaltung"]
[{"$nulls":3},{"$f":"Einstellungen!K29","v":{"v":0,"d":"0.0%"}},"inkl. USt p.a."]
["Sonstige Kosten"]
[{"$nulls":3},{"$f":"Einstellungen!K25","v":{"v":0.02,"d":"0"}},"EUR p.a., inflationiert"]
["Rücklagenbildung",null,null,"Freie Rücklage p.a.:",null,{"$f":"Einstellungen!#REF!","v":{"$error":"#REF!"}}]
[{"$nulls":3},{"$f":"IF(Einstellungen!S30=1,\"Umschichtungsrücklage\",\"\")","v":""}]
[]
["Prämissen"]
[]
["Nach Absprache mit Ihnen haben wir für die Projektion der Vermögensentwicklung folgende Durchschnittsrenditen im Wertpapierbereich unterstellt:"]
[]
[{"$nulls":3},"Durchschnittsrenditen WP"]
[]
[{"$nulls":3},"Kurs","Ausschüttg.","Gesamt"]
["Aktien",null,null,{"$f":"Einstellungen!D37","v":{"v":0,"d":"0.0%"}},{"$f":"Einstellungen!E37","v":{"v":0,"d":"0.0%"}},{"$f":"D161+E161","v":{"v":0,"d":"0.0%"}}]
["Renten",null,null,{"$f":"Einstellungen!D38","v":{"v":0,"d":"0.0%"}},{"$f":"Einstellungen!E38","v":{"v":0,"d":"0.0%"}},{"v":0,"d":"0.0%"}]
["Liquidität",null,null,{"$f":"Einstellungen!D39","v":{"v":0,"d":"0.0%"}},{"$f":"Einstellungen!E39","v":{"v":0,"d":"0.0%"}},{"v":0,"d":"0.0%"}]
["Alternative Investments",null,null,{"$f":"Einstellungen!D40","v":{"v":0,"d":"0.0%"}},{"$f":"Einstellungen!E40","v":{"v":0,"d":"0.0%"}},{"v":0,"d":"0.0%"}]
["Sonstige/Gemischt",null,null,{"$f":"Einstellungen!D41","v":{"v":0,"d":"0.0%"}},{"$f":"Einstellungen!E41","v":{"v":0,"d":"0.0%"}},{"v":0,"d":"0.0%"}]
["Gesamtrendite gewichtet",null,null,{"$f":"Einstellungen!D42","v":{"v":0,"d":"0.0%"}},{"$f":"Einstellungen!E42","v":{"v":0,"d":"0.0%"}},{"v":0,"d":"0.0%"}]
{"$rows_empty":11}
["Grundfall"]
{"$rows_empty":60}
["Ausgangsfall"]
[]
["Grafik Vermögenserhaltung"]
{"$rows_empty":25}
["Delta am Ende des Betrachtungszeitraums: ",null,null,{"$f":"'Zahlen Basis'!#REF!","v":{"$error":"#REF!"}},{"$f":"'Zahlen Basis'!#REF!","v":{"$error":"#REF!"}},"EUR"]
{"$rows_empty":33}
["Ausgangsfall"]
[]
["Einnahmen/ Ausgaben"]
{"$rows_empty":59}
["Ausgangsfall"]
[]
["Grafik Ausgabenstruktur"]
{"$rows_empty":59}
["Analyse Historie"]
[]
["Grafik Verwaltungskosten"]

{"sheet":"Entwickler","index":24,"n_rows":24,"n_cols":3,"rows_kept":24,"hidden":true}
["Entwickler"]
[null,"Version 1.53","2019-02-19"]
[]
[null,"Letzte Betaversion vom 10.01.2018:","V 1.50"]
[null,"Inflationsdaten 2018 komplett (VPI)"]
[null,"Cockpit: Historie Vermögenserhatlung separtiert, Rundinstrumente eingefügt, "]
[null,"Disclaimer eingefügt"]
[]
[]
[]
[]
[null,"To Do's:","Prio (1-3)"]
[]
[null,"Anlage der Zustiftung integrieren",1]
[null,"Neu: Sensititvitätsanalyse",3]
[null,"Druckteil komplett überarbeiten",1]
[null,"Neu: Liquiditätsübersicht",3]
[null,"Neu: Textbausteine f. Anlagerichtlinien integrieren (Bespr. BVDS v. 15.02.2018)",2]
[null,"Vergangenheitswerte Kerninflation ergänzen",2]
[null,"Integration Liquidität, Alternative Investments, Sonstige",2]
[null,"Umschaltfunktion EUR/TEUR reaktivieren",3]
[null,"Versionssicheres Cockpit",2]
[null,"Veränderung Umschichtungsrücklage",2]
[null,"Neu: Attributionsanalyse",2]